BDBM11244 AG7088 analogue 1b::ethyl (2E,4S)-4-[(2R,5S)-5-{[(benzyloxy)carbonyl]amino}-2-[(4-fluorophenyl)methyl]-6-methyl-4-oxoheptanamido]-5-[(3S)-2-oxopyrrolidin-3-yl]pent-2-enoate
SMILES CCOC(=O)\C=C\[C@H](C[C@@H]1CCNC1=O)NC(=O)[C@@H](CC(=O)[C@@H](NC(=O)OCc1ccccc1)C(C)C)Cc1ccc(F)cc1
InChI Key InChIKey=NPKSFKZRNUBNHK-JNOQTPQISA-N
Data  1 IC50
  Tab Delimited (TSV)   2D SDfile   Computed 3D by Vconf -m prep SDfile
Find this compound or compounds like it in BindingDB:
Activity Spreadsheet -- Enzyme Inhibition Constant Data from BindingDB
Found 1 hit for monomerid = 11244
TargetReplicase polyprotein 1ab(Human SARS coronavirus (SARS-CoV) (Severe acute re...)
National Taiwan University
LigandPNGBDBM11244(AG7088 analogue 1b | ethyl (2E,4S)-4-[(2R,5S)-5-{[...)
Affinity DataIC50: >1.00E+5nMpH: 7.0 T: 2°C. Assay description: The effects of compound on enzyme activity were measured by using a fluorogenic peptide cleavage assay. Enhanced fluorescence caused by cleavage of t...
In DepthDetails ArticlePubMed