BDBM112627 GNE-201
SMILES Fc1cc(F)cc(c1)S(=O)(=O)c1ccc(CNC(=O)c2ccn3cccc3c2)cc1
InChI Key InChIKey=XVCMNEXVVACQMR-UHFFFAOYSA-N
Data  1 IC50
PDB links: 1 PDB ID matches this monomer.
  Tab Delimited (TSV)   2D SDfile   Computed 3D by Vconf -m prep SDfile
Find this compound or compounds like it in BindingDB:
Activity Spreadsheet -- Enzyme Inhibition Constant Data from BindingDB
Found 1 hit for monomerid = 112627
TargetNicotinamide phosphoribosyltransferase(Homo sapiens (Human))
Genentech
LigandPNGBDBM112627(GNE-201)
Affinity DataIC50:  78nMpH: 7.5 T: 2°C. Assay description: The reaction was carried out in Buffer A (50 mM Hepes pH 7.5, 50 mM NaCl, 5 mM MgCl2, and 1 mM THP) in 96-well plates. NAMPT protein was added to 1 B...
Ligand InfoPC cidPC sidPDB