BDBM11268 N-(4-chlorophenyl)-2-({4-[2-(2-methyl-1,3-thiazol-4-yl)-1,3-thiazol-4-yl]pyrimidin-2-yl}sulfanyl)acetamide::jm5b01461, Compound 109::pyrimidine-containing compound 5
SMILES Cc1nc(cs1)-c1nc(cs1)-c1ccnc(SCC(=O)Nc2ccc(Cl)cc2)n1
InChI Key InChIKey=JEZYTEDGOJCVQS-UHFFFAOYSA-N
Data  2 IC50
  Tab Delimited (TSV)   2D SDfile   Computed 3D by Vconf -m prep SDfile
Find this compound or compounds like it in BindingDB:
Activity Spreadsheet -- Enzyme Inhibition Constant Data from BindingDB
Found 2 hits for monomerid = 11268
TargetReplicase polyprotein 1ab(Human SARS coronavirus (SARS-CoV) (Severe acute re...)
University Of Bonn
LigandPNGBDBM11268(N-(4-chlorophenyl)-2-({4-[2-(2-methyl-1,3-thiazol-...)
Affinity DataIC50:  1.40E+4nM. Assay description: This is a review article.
In DepthDetails ArticlePubMed
TargetReplicase polyprotein 1ab(Human SARS coronavirus (SARS-CoV) (Severe acute re...)
University Of Bonn
LigandPNGBDBM11268(N-(4-chlorophenyl)-2-({4-[2-(2-methyl-1,3-thiazol-...)
Affinity DataIC50:  1.40E+4nMpH: 7.0 T: 2°C. Assay description: The effects of compound on enzyme activity were measured by using a fluorogenic peptide cleavage assay. Enhanced fluorescence caused by cleavage of t...
In DepthDetails ArticlePubMed