BDBM11281 2-{[4-(dimethoxymethyl)-6-hydroxypyrimidin-2-yl]sulfanyl}-N-[4-(trifluoromethyl)phenyl]acetamide::pyrimidine-containing compound 18
SMILES COC(OC)c1cc(=O)[nH]c(SCC(=O)Nc2ccc(cc2)C(F)(F)F)n1
InChI Key InChIKey=ZCGRJMKKUYGRMN-UHFFFAOYSA-N
Data  1 IC50
  Tab Delimited (TSV)   2D SDfile   Computed 3D by Vconf -m prep SDfile
Find this compound or compounds like it in BindingDB:
Activity Spreadsheet -- Enzyme Inhibition Constant Data from BindingDB
Found 1 hit for monomerid = 11281
TargetReplicase polyprotein 1ab(Human SARS coronavirus (SARS-CoV) (Severe acute re...)
National Tsing Hua University
LigandPNGBDBM11281(2-{[4-(dimethoxymethyl)-6-hydroxypyrimidin-2-yl]su...)
Affinity DataIC50:  2.00E+5nM. Assay description: The effects of compound on enzyme activity were measured by using a fluorogenic peptide cleavage assay. Enhanced fluorescence caused by cleavage of t...
Ligand InfoPC cidPC sid
In DepthDetails ArticlePubMed