BDBM113986 MLS003875557::N-[2-[(E)-2-(octylsulfamoyl)vinyl]benzyl]carbamic acid tert-butyl ester::N-[[2-[(E)-2-(octylsulfamoyl)ethenyl]phenyl]methyl]carbamic acid tert-butyl ester::SMR002532570::cid_60156754::tert-butyl N-[[2-[(E)-2-(octylsulfamoyl)ethenyl]phenyl]methyl]carbamate
SMILES CCCCCCCCNS(=O)(=O)C=Cc1ccccc1CNC(=O)OC(C)(C)C
InChI Key InChIKey=IQUHJGYUHTUBPQ-UHFFFAOYSA-N
Data  2 IC50
  Tab Delimited (TSV)   2D SDfile   Computed 3D by Vconf -m prep SDfile
Find this compound or compounds like it in BindingDB:
Activity Spreadsheet -- Enzyme Inhibition Constant Data from BindingDB
Found 2 hits for monomerid = 113986
TargetDisintegrin and metalloproteinase domain-containing protein 10(Homo sapiens (Human))
The Scripps Research Institute Molecular Screening Center
Curated by PubChem BioAssay
LigandPNGBDBM113986(MLS003875557 | N-[2-[(E)-2-(octylsulfamoyl)vinyl]b...)
Affinity DataIC50:  7.73E+3nM. Assay description: Source (MLPCN Center Name): The Scripps Research Institute Molecular Screening Center (SRIMSC) Center Affiliation: Torrey Pines Institute for Molecul...
Ligand InfoPC cidPC sid
In DepthDetails PCBioAssay
TargetDisintegrin and metalloproteinase domain-containing protein 17(Homo sapiens (Human))
The Scripps Research Institute Molecular Screening Center
Curated by PubChem BioAssay
LigandPNGBDBM113986(MLS003875557 | N-[2-[(E)-2-(octylsulfamoyl)vinyl]b...)
Affinity DataIC50:  6.96E+4nM. Assay description: Source (MLPCN Center Name): The Scripps Research Institute Molecular Screening Center (SRIMSC) Center Affiliation: Torrey Pines Institute for Molecul...
Ligand InfoPC cidPC sid
In DepthDetails PCBioAssay