BDBM114109 MLS001156714::N-(2-methyl-5-piperidin-1-ylsulfonyl-phenyl)-2-[[4-(trifluoromethyl)phenyl]amino]ethanamide::N-(2-methyl-5-piperidin-1-ylsulfonylphenyl)-2-[4-(trifluoromethyl)anilino]acetamide::N-(2-methyl-5-piperidinosulfonyl-phenyl)-2-[4-(trifluoromethyl)anilino]acetamide::N-[2-methyl-5-(1-piperidinylsulfonyl)phenyl]-2-[4-(trifluoromethyl)anilino]acetamide::SMR000711839::cid_24406489
SMILES Cc1ccc(cc1NC(=O)CNc1ccc(cc1)C(F)(F)F)S(=O)(=O)N1CCCCC1
InChI Key InChIKey=UJQYLKZWCVBCQK-UHFFFAOYSA-N
Data  2 IC50
  Tab Delimited (TSV)   2D SDfile   Computed 3D by Vconf -m prep SDfile
Find this compound or compounds like it in BindingDB:
Activity Spreadsheet -- Enzyme Inhibition Constant Data from BindingDB
Found 2 hits for monomerid = 114109
TargetDisintegrin and metalloproteinase domain-containing protein 17(Homo sapiens (Human))
The Scripps Research Institute Molecular Screening Center
Curated by PubChem BioAssay
LigandPNGBDBM114109(MLS001156714 | N-(2-methyl-5-piperidin-1-ylsulfony...)
Affinity DataIC50:  6.95E+4nM. Assay description: Source (MLPCN Center Name): The Scripps Research Institute Molecular Screening Center (SRIMSC) Center Affiliation: Torrey Pines Institute for Molecul...
In DepthDetails PCBioAssay
TargetDisintegrin and metalloproteinase domain-containing protein 10(Homo sapiens (Human))
The Scripps Research Institute Molecular Screening Center
Curated by PubChem BioAssay
LigandPNGBDBM114109(MLS001156714 | N-(2-methyl-5-piperidin-1-ylsulfony...)
Affinity DataIC50:  8.89E+3nM. Assay description: Source (MLPCN Center Name): The Scripps Research Institute Molecular Screening Center (SRIMSC) Center Affiliation: Torrey Pines Institute for Molecul...
In DepthDetails PCBioAssay