BDBM114229 MLS000540469::N-(4-methoxyphenyl)-3-(2-thienyl)-6-(trifluoromethyl)thieno[3,2-b]pyridine-2-carboxamide::N-(4-methoxyphenyl)-3-thiophen-2-yl-6-(trifluoromethyl)-2-thieno[3,2-b]pyridinecarboxamide::N-(4-methoxyphenyl)-3-thiophen-2-yl-6-(trifluoromethyl)thieno[3,2-b]pyridine-2-carboxamide::SMR000125727::cid_1471994
SMILES COc1ccc(NC(=O)c2sc3cc(cnc3c2-c2cccs2)C(F)(F)F)cc1
InChI Key InChIKey=XKTDIJQGUBASII-UHFFFAOYSA-N
Data  2 IC50
  Tab Delimited (TSV)   2D SDfile   Computed 3D by Vconf -m prep SDfile
Find this compound or compounds like it in BindingDB:
Activity Spreadsheet -- Enzyme Inhibition Constant Data from BindingDB
Found 2 hits for monomerid = 114229
Target1-phosphatidylinositol 4,5-bisphosphate phosphodiesterase beta-3(Homo sapiens (Human))
The Scripps Research Institute Molecular Screening Center
Curated by PubChem BioAssay
LigandPNGBDBM114229(MLS000540469 | N-(4-methoxyphenyl)-3-(2-thienyl)-6...)
Affinity DataIC50:  1.22E+5nM. Assay description: Source (MLPCN Center Name): The Scripps Research Institute Molecular Screening Center (SRIMSC) Center Affiliation: The Scripps Research Institute Ass...
In DepthDetails PCBioAssay
Target1-phosphatidylinositol 4,5-bisphosphate phosphodiesterase gamma-1 [1-999,I813T](Homo sapiens (Human))
The Scripps Research Institute Molecular Screening Center
Curated by PubChem BioAssay
LigandPNGBDBM114229(MLS000540469 | N-(4-methoxyphenyl)-3-(2-thienyl)-6...)
Affinity DataIC50:  1.22E+5nM. Assay description: Source (MLPCN Center Name): The Scripps Research Institute Molecular Screening Center (SRIMSC) Center Affiliation: The Scripps Research Institute Ass...
In DepthDetails PCBioAssay