BDBM114503 MLS000724624::N'-(5,7-dimethyl-1,3-benzothiazol-2-yl)-2,3-dihydro-1,4-benzodioxin-3-carbohydrazide::N'-(5,7-dimethyl-1,3-benzothiazol-2-yl)-2,3-dihydro-1,4-benzodioxine-3-carbohydrazide::SMR000237459::cid_15944883
SMILES Cc1cc(C)c2sc(NNC(=O)C3COc4ccccc4O3)nc2c1
InChI Key InChIKey=XUBNUDUHWVTPJM-UHFFFAOYSA-N
Data  1 IC50
  Tab Delimited (TSV)   2D SDfile   Computed 3D by Vconf -m prep SDfile
Find this compound or compounds like it in BindingDB:
Activity Spreadsheet -- Enzyme Inhibition Constant Data from BindingDB
Found 1 hit for monomerid = 114503
TargetGroup 3 secretory phospholipase A2(Homo sapiens)
The Scripps Research Institute Molecular Screening Center
Curated by PubChem BioAssay
LigandPNGBDBM114503(MLS000724624 | N'-(5,7-dimethyl-1,3-benzothiazol-2...)
Affinity DataIC50:  2.62E+4nM. Assay description: Source (MLPCN Center Name): The Scripps Research Institute Molecular Screening Center Affiliation: The Scripps Research Institute, TSRI Assay Provide...
In DepthDetails PCBioAssay