BDBM114649 CHEMBL1698064::MLS002607791::N-[3-(1,3-benzothiazol-2-yl)-5-isopropyl-4,6-dihydrothieno[2,3-c]pyrrol-2-yl]acetamide;2,2,2-trifluoroacetic acid::N-[3-(1,3-benzothiazol-2-yl)-5-propan-2-yl-4,6-dihydrothieno[2,3-c]pyrrol-2-yl]acetamide;2,2,2-trifluoroacetic acid::N-[3-(1,3-benzothiazol-2-yl)-5-propan-2-yl-4,6-dihydrothieno[2,3-c]pyrrol-2-yl]ethanamide;2,2,2-tris(fluoranyl)ethanoic acid::SMR001522665::cid_53338852
SMILES CC(C)N1Cc2sc(NC(C)=O)c(-c3nc4ccccc4s3)c2C1
InChI Key InChIKey=CZIACNCULOWAAI-UHFFFAOYSA-N
Data  3 IC50
  Tab Delimited (TSV)   2D SDfile   Computed 3D by Vconf -m prep SDfile
Find this compound or compounds like it in BindingDB:
Activity Spreadsheet -- Enzyme Inhibition Constant Data from BindingDB
Found 3 hits for monomerid = 114649
TargetMethyl-CpG-binding domain protein 2(Homo sapiens (Human))
The Scripps Research Institute Molecular Screening Center
Curated by PubChem BioAssay
LigandPNGBDBM114649(CHEMBL1698064 | MLS002607791 | N-[3-(1,3-benzothia...)
Affinity DataIC50:  2.42E+4nM. Assay description: Source (MLPCN Center Name): The Scripps Research Institute Molecular Screening Center Affiliation: The Scripps Research Institute, TSRI Assay Provide...
In DepthDetails PCBioAssay
TargetDNA-(apurinic or apyrimidinic site) endonuclease(Homo sapiens (Human))
National Center For Advancing Translational Sciences
Curated by ChEMBL
LigandPNGBDBM114649(CHEMBL1698064 | MLS002607791 | N-[3-(1,3-benzothia...)
Affinity DataIC50:  4.00E+3nM. Assay description: Inhibition of recombinant APE1 using [35P]-5'-AP-DNA as substrate incubated for 15 mins prior to substrate addition measured after 5 mins by PAGE ana...
In DepthDetails ArticlePubMed
TargetDNA-(apurinic or apyrimidinic site) endonuclease(Homo sapiens (Human))
National Center For Advancing Translational Sciences
Curated by ChEMBL
LigandPNGBDBM114649(CHEMBL1698064 | MLS002607791 | N-[3-(1,3-benzothia...)
Affinity DataIC50:  3.10E+3nM. Assay description: Inhibition of human recombinant APE1 after 15 mins by fluorescence based HTS assay
In DepthDetails ArticlePubMed