BDBM114676 MLS000040162::SMR000045256::cid_6880170
SMILES Cc1nc2n(\N=C\c3ccco3)c3nc4ccccc4nc3c2c(=O)n1CCC1=CCCCC1
InChI Key InChIKey=WSFJMFPZQOFPCL-JVWAILMASA-N
Data  1 IC50
  Tab Delimited (TSV)   2D SDfile   Computed 3D by Vconf -m prep SDfile
Find this compound or compounds like it in BindingDB:
Activity Spreadsheet -- Enzyme Inhibition Constant Data from BindingDB
Found 1 hit for monomerid = 114676
TargetProtein artemis(Homo sapiens (Human))
Burnham Center For Chemical Genomics
Curated by PubChem BioAssay
LigandPNGBDBM114676(MLS000040162 | SMR000045256 | cid_6880170)
Affinity DataIC50:  1.85E+4nM. Assay description: Data Source: Sanford-Burnham Center for Chemical Genomics (SBCCG) Source Affiliation: Sanford-Burnham Medical Research Institute (SBMRI, San Diego CA...
In DepthDetails PCBioAssay