BDBM114693 3-Amino-6-methyl-4-thiophen-2-yl-5,6,7,8-tetrahydro-thieno[2,3-b][1,6]naphthyridine-2-carboxylic acid m-tolylamide::3-amino-6-methyl-N-(3-methylphenyl)-4-thiophen-2-yl-7,8-dihydro-5H-thieno[2,3-b][1,6]naphthyridine-2-carboxamide::3-amino-6-methyl-N-(m-tolyl)-4-(2-thienyl)-7,8-dihydro-5H-thieno[2,3-b][1,6]naphthyridine-2-carboxamide::3-azanyl-6-methyl-N-(3-methylphenyl)-4-thiophen-2-yl-7,8-dihydro-5H-thieno[2,3-b][1,6]naphthyridine-2-carboxamide::MLS000552605::SMR000146120::cid_3815983
SMILES CN1CCc2nc3sc(C(=O)Nc4cccc(C)c4)c(N)c3c(-c3cccs3)c2C1
InChI Key InChIKey=NOVBDZFIWUWQPR-UHFFFAOYSA-N
Data  1 IC50
  Tab Delimited (TSV)   2D SDfile   Computed 3D by Vconf -m prep SDfile
Find this compound or compounds like it in BindingDB:
Activity Spreadsheet -- Enzyme Inhibition Constant Data from BindingDB
Found 1 hit for monomerid = 114693
TargetProtein artemis(Homo sapiens (Human))
Burnham Center For Chemical Genomics
Curated by PubChem BioAssay
LigandPNGBDBM114693(3-Amino-6-methyl-4-thiophen-2-yl-5,6,7,8-tetrahydr...)
Affinity DataIC50:  2.00E+4nM. Assay description: Data Source: Sanford-Burnham Center for Chemical Genomics (SBCCG) Source Affiliation: Sanford-Burnham Medical Research Institute (SBMRI, San Diego CA...
In DepthDetails PCBioAssay