BDBM114967 5-(2-furanyl)-N-(2-phenylethyl)-3-isoxazolecarboxamide::5-(2-furyl)-N-(2-phenylethyl)isoxazole-3-carboxamide::5-(2-furyl)-N-phenethyl-isoxazole-3-carboxamide::5-(furan-2-yl)-N-(2-phenylethyl)-1,2-oxazole-3-carboxamide::MLS000087198::SMR000023421::cid_3245765
SMILES O=C(NCCc1ccccc1)c1cc(on1)-c1ccco1
InChI Key InChIKey=KSWYOFGMLOJPMD-UHFFFAOYSA-N
Data  1 EC50
  Tab Delimited (TSV)   2D SDfile   Computed 3D by Vconf -m prep SDfile
Find this compound or compounds like it in BindingDB:
Activity Spreadsheet -- Enzyme Inhibition Constant Data from BindingDB
Found 1 hit for monomerid = 114967
TargetOxysterols receptor LXR-beta(Homo sapiens (Human))
The Scripps Research Institute Molecular Screening Center
Curated by PubChem BioAssay
LigandPNGBDBM114967(5-(2-furanyl)-N-(2-phenylethyl)-3-isoxazolecarboxa...)
Affinity DataEC50:  6.75E+4nM. Assay description: Source (MLPCN Center Name): The Scripps Research Institute Molecular Screening Center Affiliation: UT Southwestern Assay Provider: David Mangelsdorf,...
In DepthDetails PCBioAssay