BDBM114978 2-furancarboxylic acid [(Z)-[amino-(3-methylphenyl)methylidene]amino] ester::MLS000533507::N'-(2-furoyloxy)-3-methylbenzenecarboximidamide::SMR000140945::[(Z)-[amino-(3-methylphenyl)methylidene]amino] furan-2-carboxylate::[(Z)-[azanyl-(3-methylphenyl)methylidene]amino] furan-2-carboxylate::cid_5346031::furan-2-carboxylic acid [(Z)-[amino(m-tolyl)methylene]amino] ester
SMILES Cc1cccc(c1)C(N)=NOC(=O)c1ccco1
InChI Key InChIKey=QKEPUYQNERUQSB-UHFFFAOYSA-N
Data  1 EC50
  Tab Delimited (TSV)   2D SDfile   Computed 3D by Vconf -m prep SDfile
Find this compound or compounds like it in BindingDB:
Activity Spreadsheet -- Enzyme Inhibition Constant Data from BindingDB
Found 1 hit for monomerid = 114978
TargetOxysterols receptor LXR-beta(Homo sapiens (Human))
The Scripps Research Institute Molecular Screening Center
Curated by PubChem BioAssay
LigandPNGBDBM114978(2-furancarboxylic acid [(Z)-[amino-(3-methylphenyl...)
Affinity DataEC50:  6.76E+4nM. Assay description: Source (MLPCN Center Name): The Scripps Research Institute Molecular Screening Center Affiliation: UT Southwestern Assay Provider: David Mangelsdorf,...
In DepthDetails PCBioAssay