BDBM115049 4-[(2-bromanyl-4-methyl-phenyl)hydrazinylidene]cyclohexa-2,5-dien-1-one::4-[(2-bromo-4-methyl-phenyl)hydrazono]cyclohexa-2,5-dien-1-one::4-[(2-bromo-4-methylphenyl)diazenyl]phenol::4-[(2-bromo-4-methylphenyl)hydrazinylidene]-1-cyclohexa-2,5-dienone::4-[(2-bromo-4-methylphenyl)hydrazinylidene]cyclohexa-2,5-dien-1-one::MLS001180977::SMR000477771::cid_5368817
SMILES Cc1ccc(N=Nc2ccc(O)cc2)c(Br)c1
InChI Key InChIKey=YIDMWLUFNVJJHD-UHFFFAOYSA-N
Data  1 EC50
  Tab Delimited (TSV)   2D SDfile   Computed 3D by Vconf -m prep SDfile
Find this compound or compounds like it in BindingDB:
Activity Spreadsheet -- Enzyme Inhibition Constant Data from BindingDB
Found 1 hit for monomerid = 115049
TargetOxysterols receptor LXR-beta(Homo sapiens (Human))
The Scripps Research Institute Molecular Screening Center
Curated by PubChem BioAssay
LigandPNGBDBM115049(4-[(2-bromanyl-4-methyl-phenyl)hydrazinylidene]cyc...)
Affinity DataEC50:  6.75E+4nM. Assay description: Source (MLPCN Center Name): The Scripps Research Institute Molecular Screening Center Affiliation: UT Southwestern Assay Provider: David Mangelsdorf,...
In DepthDetails PCBioAssay