BDBM117018 US8664258, 197::US9987252, 197
SMILES Cn1ncc(Cl)c1-c1cc(NC(=O)c2ccc(F)c(c2)C(F)(F)F)ccc1OCCN
InChI Key InChIKey=RJTDCESQPZRXMX-UHFFFAOYSA-N
Data  2 IC50
  Tab Delimited (TSV)   2D SDfile   Computed 3D by Vconf -m prep SDfile
Find this compound or compounds like it in BindingDB:
Activity Spreadsheet -- Enzyme Inhibition Constant Data from BindingDB
Found 2 hits for monomerid = 117018
Target5-hydroxytryptamine receptor 2A(Homo sapiens (Human))
Arena Pharmaceuticals
US Patent
LigandPNGBDBM117018(US8664258, 197 | US9987252, 197)
Affinity DataIC50:  1nM. Assay description: Radioligand binding assays for human 5-HT2A receptor was conducted using the 5-HT2 agonist [125I]DOI as radioligand. To define nonspecific binding, 1...
In DepthDetails US Patent
Target5-hydroxytryptamine receptor 2A(Homo sapiens (Human))
Arena Pharmaceuticals
US Patent
LigandPNGBDBM117018(US8664258, 197 | US9987252, 197)
Affinity DataIC50:  1nMpH: 7.4 T: 2°C. Assay description: Radioligand binding assays for human 5-HT2A receptor was conducted using the 5-HT2 agonist [125]DOI as radioligand. To define nonspecific binding, 10...
In DepthDetails US Patent