BDBM120754 US8703761, 1-6
SMILES CC(C)(NS(=O)(=O)c1ccc(F)cc1)C(=O)Nc1nc(c(Cc2ccccc2)s1)-c1ccccc1
InChI Key InChIKey=GGTRUGFJCDQWNM-UHFFFAOYSA-N
Data  1 IC50
  Tab Delimited (TSV)   2D SDfile   Computed 3D by Vconf -m prep SDfile
Find this compound or compounds like it in BindingDB:
Activity Spreadsheet -- Enzyme Inhibition Constant Data from BindingDB
Found 1 hit for monomerid = 120754
TargetDiacylglycerol O-acyltransferase 1 [89-488](Homo sapiens (Human))
Novartis
US Patent
LigandPNGBDBM120754(US8703761, 1-6)
Affinity DataIC50:  241nMpH: 7.5 T: 2°C. Assay description: The enzyme preparation used in this assay is a membrane preparation from Sf9 cells overexpressing human (His)6DGAT1. During all steps samples were ch...
Ligand InfoPC cidPC sid
In DepthDetails US Patent