BDBM123134 US8742113, 68
SMILES CCOC(=O)C1C(OC(=Cc2c[nH]c3ncccc23)C1=O)=Nc1ccc2c[nH]nc2c1
InChI Key InChIKey=VQJSFMIZAKBCNS-LBRWCHMXSA-N
Data  1 IC50
  Tab Delimited (TSV)   2D SDfile   Computed 3D by Vconf -m prep SDfile
Find this compound or compounds like it in BindingDB:
Activity Spreadsheet -- Enzyme Inhibition Constant Data from BindingDB
Found 1 hit for monomerid = 123134
TargetCell division cycle 7-related protein kinase(Homo sapiens (Human))
Sbi Biotech
US Patent
LigandPNGBDBM123134(US8742113, 68)
Affinity DataIC50:  4nMpH: 7.5Assay Description:Measurement of kinase activity was carried out using an MSA assay kit (QuickScout Screening Assist Kit, Carna Biosciences, Inc.). Assay buffer (20 mM...
In DepthDetails US Patent