BDBM123136 US8742113, 81
SMILES CCOC(=O)C1C(C=C(Cc2c[nH]c3ncccc23)C1=O)=Nc1ccc(OCCO)cc1F
InChI Key InChIKey=KKHSLJYDYXXAQY-RRAHZORUSA-N
Data  1 IC50
  Tab Delimited (TSV)   2D SDfile   Computed 3D by Vconf -m prep SDfile
Find this compound or compounds like it in BindingDB:
Activity Spreadsheet -- Enzyme Inhibition Constant Data from BindingDB
Found 1 hit for monomerid = 123136
TargetCell division cycle 7-related protein kinase(Homo sapiens (Human))
Sbi Biotech
US Patent
LigandPNGBDBM123136(US8742113, 81)
Affinity DataIC50:  5nMpH: 7.5Assay Description:Measurement of kinase activity was carried out using an MSA assay kit (QuickScout Screening Assist Kit, Carna Biosciences, Inc.). Assay buffer (20 mM...
Ligand InfoPC cidPC sid
In DepthDetails US Patent