BDBM12519 (2S)-2-[(3S)-3-[(6-chloronaphthalene-2-)sulfonamido]-2-oxopyrrolidin-1-yl]-N-(2-hydroxyethyl)-N-(propan-2-yl)propanamide::P4 alanylamide pyrrolidin-2-one 30
SMILES CC(C)N(CCO)C(=O)[C@H](C)N1CC[C@H](NS(=O)(=O)c2ccc3cc(Cl)ccc3c2)C1=O
InChI Key InChIKey=RIQHMAOZARRSCE-YWZLYKJASA-N
Data  1 KI
  Tab Delimited (TSV)   2D SDfile   Computed 3D by Vconf -m prep SDfile
Find this compound or compounds like it in BindingDB:
Activity Spreadsheet -- Enzyme Inhibition Constant Data from BindingDB
Found 1 hit for monomerid = 12519
TargetCoagulation factor X(Homo sapiens (Human))
Glaxosmithkline
LigandPNGBDBM12519((2S)-2-[(3S)-3-[(6-chloronaphthalene-2-)sulfonamid...)
Affinity DataKi:  6nM. Assay description: The inhibitory effect of test compound for human fXa was determined by using the chromogenic substrate. The hydrolysis rates of chromogenic substrate...
In DepthDetails ArticlePubMed