BDBM12555 6-chloro-N-methyl-N-[(3S)-2-oxo-1-[2-oxo-2-(piperidin-1-yl)ethyl]pyrrolidin-3-yl]naphthalene-2-sulfonamide::pyrrolidin-2-one-based inhibitor 3
SMILES CN([C@H]1CCN(CC(=O)N2CCCCC2)C1=O)S(=O)(=O)c1ccc2cc(Cl)ccc2c1
InChI Key InChIKey=MWQBNLSJBXNUDC-FQEVSTJZSA-N
Data  1 KI
  Tab Delimited (TSV)   2D SDfile   Computed 3D by Vconf -m prep SDfile
Find this compound or compounds like it in BindingDB:
Activity Spreadsheet -- Enzyme Inhibition Constant Data from BindingDB
Found 1 hit for monomerid = 12555
TargetCoagulation factor X(Homo sapiens (Human))
Glaxosmithkline
LigandPNGBDBM12555(6-chloro-N-methyl-N-[(3S)-2-oxo-1-[2-oxo-2-(piperi...)
Affinity DataKi:  72nM ΔG°:  -9.74kcal/molepH: 7.8 T: 2°C. Assay description: The inhibitory effect of test compound for human fXa was determined by using the chromogenic substrate. The hydrolysis rates of chromogenic substrate...
In DepthDetails ArticlePubMed