BDBM128207 (Z)-2-(1,3-benzoxazol-2-yl)-3-(2-pyridinylamino)-2-propenal::(Z)-2-(1,3-benzoxazol-2-yl)-3-(2-pyridylamino)acrolein::(Z)-2-(1,3-benzoxazol-2-yl)-3-(pyridin-2-ylamino)prop-2-enal::2-Benzooxazol-2-yl-3-(pyridin-2-ylamino)-propenal::MLS000525515::SMR000115989::cid_2249389
SMILES O=C\C(=C/Nc1ccccn1)c1nc2ccccc2o1
InChI Key InChIKey=GFXCWBFSVKWYQV-PKNBQFBNSA-N
Data  1 IC50  1 EC50
  Tab Delimited (TSV)   2D SDfile   Computed 3D by Vconf -m prep SDfile
Find this compound or compounds like it in BindingDB:
Activity Spreadsheet -- Enzyme Inhibition Constant Data from BindingDB
Found 2 hits for monomerid = 128207
TargetTransthyretin(Homo sapiens (Human))
The Scripps Research Institute Molecular Screening Center
Curated by PubChem BioAssay
LigandPNGBDBM128207((Z)-2-(1,3-benzoxazol-2-yl)-3-(2-pyridinylamino)-2...)
Affinity DataEC50: >1.67E+5nM. Assay description: Source (MLPCN Center Name): The Scripps Research Institute Molecular Screening Center (SRIMSC) Affiliation: The Scripps Research Institute, TSRI Assa...
In DepthDetails PCBioAssay
TargetTransthyretin(Homo sapiens (Human))
The Scripps Research Institute Molecular Screening Center
Curated by PubChem BioAssay
LigandPNGBDBM128207((Z)-2-(1,3-benzoxazol-2-yl)-3-(2-pyridinylamino)-2...)
Affinity DataIC50: >1.84E+4nM. Assay description: Source (MLPCN Center Name): The Scripps Research Institute Molecular Screening Center (SRIMSC) Affiliation: The Scripps Research Institute, TSRI Assa...
In DepthDetails PCBioAssay