BDBM13463 N-{3-[2-({[3-(sulfoamino)phenyl]methyl}carbamoyl)ethyl]phenyl}sulfamic acid::benzyl amine deriv. 11
SMILES OS(=O)(=O)Nc1cccc(CCC(=O)NCc2cccc(NS(O)(=O)=O)c2)c1
InChI Key InChIKey=UWGCDTODPMLETQ-UHFFFAOYSA-N
Data  1 IC50
PDB links: 1 PDB ID matches this monomer.
  Tab Delimited (TSV)   2D SDfile   Computed 3D by Vconf -m prep SDfile
Find this compound or compounds like it in BindingDB:
Activity Spreadsheet -- Enzyme Inhibition Constant Data from BindingDB
Found 1 hit for monomerid = 13463
TargetTyrosine-protein phosphatase non-receptor type 1 [1-298](Homo sapiens (Human))
Procter & Gamble Pharmaceuticals
LigandPNGBDBM13463(N-{3-[2-({[3-(sulfoamino)phenyl]methyl}carbamoyl)e...)
Affinity DataIC50:  3.35E+4nM. Assay description: The activity of PTP1B enzyme was assayed with DiFMUP as substrate. Hydrolysis of substrate was monitored on a Victor V plate reader (Wallac). Kinetic...