BDBM13758 (1R,3R,4S,7S)-4-[2-(3-chlorophenoxy)-2-methylpropanamido]adamantane-1-carboxylic acid::adamantane ether 8
SMILES CC(C)(Oc1cccc(Cl)c1)C(=O)N[C@H]1C2C[C@@H]3C[C@@H]1C[C@](C3)(C2)C(O)=O
InChI Key InChIKey=CBUFQCLXNNQQNG-PRXKHIFWSA-N
Data  5 IC50
  Tab Delimited (TSV)   2D SDfile   Computed 3D by Vconf -m prep SDfile
Find this compound or compounds like it in BindingDB:
Activity Spreadsheet -- Enzyme Inhibition Constant Data from BindingDB
Found 5 hits for monomerid = 13758
Target11-beta-hydroxysteroid dehydrogenase 1(Homo sapiens (Human))
Abbott Laboratories
LigandPNGBDBM13758((1R,3R,4S,7S)-4-[2-(3-chlorophenoxy)-2-methylpropa...)
Affinity DataIC50:  15nMpH: 7.2 T: 2°C. Assay description: Enzyme assays were performed using purified recombinant human or mouse11beta-HSD1. The fractional conversion of cortisone to cortisol was used to det...
In DepthDetails ArticlePubMed
Target11-beta-hydroxysteroid dehydrogenase type 2(Homo sapiens (Human))
Abbott Laboratories
LigandPNGBDBM13758((1R,3R,4S,7S)-4-[2-(3-chlorophenoxy)-2-methylpropa...)
Affinity DataIC50:  3.50E+3nM. Assay description: The in Vitro 11beta-HSD2 dehydrogenase assays were developed using the cell lysates that had the full length human or mouse 11beta-HSD2 cDNA over exp...
In DepthDetails ArticlePubMed
Target11-beta-hydroxysteroid dehydrogenase 1(Homo sapiens (Human))
Abbott Laboratories
LigandPNGBDBM13758((1R,3R,4S,7S)-4-[2-(3-chlorophenoxy)-2-methylpropa...)
Affinity DataIC50:  15.1nM. Assay description: Inhibition of 11beta-HSD1
In DepthDetails ArticlePubMed
Target11-beta-hydroxysteroid dehydrogenase type 2(Mus musculus (mouse))
Abbott Laboratories
LigandPNGBDBM13758((1R,3R,4S,7S)-4-[2-(3-chlorophenoxy)-2-methylpropa...)
Affinity DataIC50:  540nM. Assay description: The in Vitro 11beta-HSD2 dehydrogenase assays were developed using the cell lysates that had the full length human or mouse 11beta-HSD2 cDNA over exp...
In DepthDetails ArticlePubMed
Target11-beta-hydroxysteroid dehydrogenase 1(Mus musculus (mouse))
Abbott Laboratories
LigandPNGBDBM13758((1R,3R,4S,7S)-4-[2-(3-chlorophenoxy)-2-methylpropa...)
Affinity DataIC50:  51nM. Assay description: Enzyme assays were performed using purified recombinant human or mouse11beta-HSD1. The fractional conversion of cortisone to cortisol was used to det...
In DepthDetails ArticlePubMed