BDBM138339 US8877944, 43
SMILES CCc1ccc(CN2CCC(CC2)N2Cc3cccc(C(N)=O)c3C2=O)cc1
InChI Key InChIKey=XZQCTFIYSCYMLY-UHFFFAOYSA-N
Data  1 IC50  1 Kd
  Tab Delimited (TSV)   2D SDfile   Computed 3D by Vconf -m prep SDfile
Find this compound or compounds like it in BindingDB:
Activity Spreadsheet -- Enzyme Inhibition Constant Data from BindingDB
Found 2 hits for monomerid = 138339
TargetPoly [ADP-ribose] polymerase 1(Mus musculus)
Nerviano Medical Sciences
US Patent
LigandPNGBDBM138339(US8877944, 43)
Affinity DataIC50:  2.66E+3nM. Assay description: Affinity evaluation of the tested compounds and their selectivity with respect to the different PARP isoforms of interest was assessed in a displacem...
In DepthDetails US Patent
TargetPoly [ADP-ribose] polymerase 1(Mus musculus)
Nerviano Medical Sciences
US Patent
LigandPNGBDBM138339(US8877944, 43)
Affinity DataKd: <30nM. Assay description: The assay is based on the use of a probe of formula (IP) that binds to the NAD binding pocket and takes advantage of the significant change in the po...
In DepthDetails US Patent