BDBM143753 US10183953, Example 43::US8969352, 14::US8969352, 43::US9611277, Example 43::US9845333, 43
SMILES Fc1ccc(c(c1)C(=O)N1CC2CC(Oc3ccc(cn3)C(F)(F)F)C1C2)-n1nccn1
InChI Key InChIKey=PSMGZVKVWYLIHB-UHFFFAOYSA-N
Data  36 KI
  Tab Delimited (TSV)   2D SDfile   Computed 3D by Vconf -m prep SDfile
Find this compound or compounds like it in BindingDB:
Activity Spreadsheet -- Enzyme Inhibition Constant Data from BindingDB
Found 36 hits for monomerid = 143753
TargetOrexin/Hypocretin receptor type 1(Homo sapiens (Human))
Janssen Pharmaceutica
US Patent
LigandPNGBDBM143753(US10183953, Example 43 | US8969352, 14 | US8969352...)
Affinity DataKi:  8nM. Assay description: CHO cells stably transfected with the human orexin 1 receptor (Genebank accession number NM_001526) were grown to confluency in DMEM/F12, 10% FBS, 1×...
In DepthDetails US Patent
TargetOrexin/Hypocretin receptor type 1(Homo sapiens (Human))
Janssen Pharmaceutica
US Patent
LigandPNGBDBM143753(US10183953, Example 43 | US8969352, 14 | US8969352...)
Affinity DataKi:  8nM. Assay description: HEK293 stably expressing human orexin 2 receptor (Genebank accession number NM_001526) were grown to confluency in DMEM (Hyclone, cat # SH30022), 10%...
In DepthDetails US Patent
TargetOrexin/Hypocretin receptor type 1(Homo sapiens (Human))
Janssen Pharmaceutica
US Patent
LigandPNGBDBM143753(US10183953, Example 43 | US8969352, 14 | US8969352...)
Affinity DataKi:  8nM. Assay description: Rat and Human Orexin 1 Receptor:Human Embryonic Kidney 293 cells (HEK293) stably expressing rat orexin 1 receptor (Genebank accession number NM_00152...
In DepthDetails US Patent
TargetOrexin/Hypocretin receptor type 1(Homo sapiens (Human))
Janssen Pharmaceutica
US Patent
LigandPNGBDBM143753(US10183953, Example 43 | US8969352, 14 | US8969352...)
Affinity DataKi:  8nM ΔG°:  -10.3kcal/moleT: 2°C. Assay description: Human Embryonic Kidney 293 cells (HEK293) stably expressing rat orexin 1 receptor (Genebank accession number NM 001525) or Chinese ovary cells (CHO) ...
In DepthDetails US Patent
TargetOrexin/Hypocretin receptor type 1(Rattus norvegicus (Rat))
Janssen Pharmaceutica
US Patent
LigandPNGBDBM143753(US10183953, Example 43 | US8969352, 14 | US8969352...)
Affinity DataKi:  16nM. Assay description: Human Embryonic Kidney 293 cells (HEK293) stably expressing rat orexin 1 receptor (Genebank accession number NM_001525) or Chinese ovary cells (CHO) ...
In DepthDetails US Patent
TargetOrexin/Hypocretin receptor type 1(Rattus norvegicus (Rat))
Janssen Pharmaceutica
US Patent
LigandPNGBDBM143753(US10183953, Example 43 | US8969352, 14 | US8969352...)
Affinity DataKi:  16nM. Assay description: Human Embryonic Kidney 293 cells (HEK293) stably expressing rat orexin 1 receptor (Genebank accession number NM_001525) or Chinese ovary cells (CHO) ...
In DepthDetails US Patent
TargetOrexin/Hypocretin receptor type 1(Homo sapiens (Human))
Janssen Pharmaceutica
US Patent
LigandPNGBDBM143753(US10183953, Example 43 | US8969352, 14 | US8969352...)
Affinity DataKi:  16nM. Assay description: CHO cells stably transfected with the human orexin 1 receptor (Genebank accession number NM_001526) were grown to confluency in DMEM/F12, 10% FBS, 1×...
In DepthDetails US Patent
TargetOrexin/Hypocretin receptor type 1(Rattus norvegicus (Rat))
Janssen Pharmaceutica
US Patent
LigandPNGBDBM143753(US10183953, Example 43 | US8969352, 14 | US8969352...)
Affinity DataKi:  16nM. Assay description: Human Embryonic Kidney 293 cells (HEK293) stably expressing rat orexin 1 receptor (Genebank accession number NM_001525) or Chinese ovary cells (CHO) ...
In DepthDetails US Patent
TargetOrexin/Hypocretin receptor type 1(Rattus norvegicus (Rat))
Janssen Pharmaceutica
US Patent
LigandPNGBDBM143753(US10183953, Example 43 | US8969352, 14 | US8969352...)
Affinity DataKi:  16nM ΔG°:  -9.88kcal/moleT: 2°C. Assay description: Human Embryonic Kidney 293 cells (HEK293) stably expressing rat orexin 1 receptor (Genebank accession number NM 001525) or Chinese ovary cells (CHO) ...
In DepthDetails US Patent
TargetOrexin/Hypocretin receptor type 1(Rattus norvegicus (Rat))
Janssen Pharmaceutica
US Patent
LigandPNGBDBM143753(US10183953, Example 43 | US8969352, 14 | US8969352...)
Affinity DataKi:  16nM. Assay description: Rat and Human Orexin 1 Receptor:Human Embryonic Kidney 293 cells (HEK293) stably expressing rat orexin 1 receptor (Genebank accession number NM_00152...
In DepthDetails US Patent
TargetOrexin/Hypocretin receptor type 1(Rattus norvegicus (Rat))
Janssen Pharmaceutica
US Patent
LigandPNGBDBM143753(US10183953, Example 43 | US8969352, 14 | US8969352...)
Affinity DataKi:  16nM. Assay description: Rat and Human Orexin 1 Receptor:Human Embryonic Kidney 293 cells (HEK293) stably expressing rat orexin 1 receptor (Genebank accession number NM_00152...
In DepthDetails US Patent
TargetOrexin/Hypocretin receptor type 1(Homo sapiens (Human))
Janssen Pharmaceutica
US Patent
LigandPNGBDBM143753(US10183953, Example 43 | US8969352, 14 | US8969352...)
Affinity DataKi:  16nM. Assay description: HEK293 stably expressing human orexin 2 receptor (Genebank accession number NM_001526) were grown to confluency in DMEM (Hyclone, cat # SH30022), 10%...
In DepthDetails US Patent
TargetOrexin/Hypocretin receptor type 1(Rattus norvegicus (Rat))
Janssen Pharmaceutica
US Patent
LigandPNGBDBM143753(US10183953, Example 43 | US8969352, 14 | US8969352...)
Affinity DataKi:  16nM ΔG°:  -9.88kcal/moleT: 2°C. Assay description: Human Embryonic Kidney 293 cells (HEK293) stably expressing rat orexin 1 receptor (Genebank accession number NM 001525) or Chinese ovary cells (CHO) ...
In DepthDetails US Patent
TargetOrexin/Hypocretin receptor type 1(Rattus norvegicus (Rat))
Janssen Pharmaceutica
US Patent
LigandPNGBDBM143753(US10183953, Example 43 | US8969352, 14 | US8969352...)
Affinity DataKi:  16nM. Assay description: Human Embryonic Kidney 293 cells (HEK293) stably expressing rat orexin 1 receptor (Genebank accession number NM_001525) or Chinese ovary cells (CHO) ...
In DepthDetails US Patent
TargetOrexin/Hypocretin receptor type 1(Rattus norvegicus (Rat))
Janssen Pharmaceutica
US Patent
LigandPNGBDBM143753(US10183953, Example 43 | US8969352, 14 | US8969352...)
Affinity DataKi:  17nM. Assay description: Human Embryonic Kidney 293 cells (HEK293) stably expressing rat orexin 1 receptor (Genebank accession number NM_001525) or Chinese ovary cells (CHO) ...
In DepthDetails US Patent
TargetOrexin/Hypocretin receptor type 1(Rattus norvegicus (Rat))
Janssen Pharmaceutica
US Patent
LigandPNGBDBM143753(US10183953, Example 43 | US8969352, 14 | US8969352...)
Affinity DataKi:  17nM. Assay description: Human Embryonic Kidney 293 cells (HEK293) stably expressing rat orexin 1 receptor (Genebank accession number NM_001525) or Chinese ovary cells (CHO) ...
In DepthDetails US Patent
TargetOrexin/Hypocretin receptor type 1(Homo sapiens (Human))
Janssen Pharmaceutica
US Patent
LigandPNGBDBM143753(US10183953, Example 43 | US8969352, 14 | US8969352...)
Affinity DataKi:  21nM. Assay description: HEK293 stably expressing human orexin 2 receptor (Genebank accession number NM_001526) were grown to confluency in DMEM (Hyclone, cat # SH30022), 10%...
In DepthDetails US Patent
TargetOrexin/Hypocretin receptor type 1(Homo sapiens (Human))
Janssen Pharmaceutica
US Patent
LigandPNGBDBM143753(US10183953, Example 43 | US8969352, 14 | US8969352...)
Affinity DataKi:  21nM ΔG°:  -9.73kcal/moleT: 2°C. Assay description: Human Embryonic Kidney 293 cells (HEK293) stably expressing rat orexin 1 receptor (Genebank accession number NM 001525) or Chinese ovary cells (CHO) ...
In DepthDetails US Patent
TargetOrexin/Hypocretin receptor type 1(Homo sapiens (Human))
Janssen Pharmaceutica
US Patent
LigandPNGBDBM143753(US10183953, Example 43 | US8969352, 14 | US8969352...)
Affinity DataKi:  21nM. Assay description: Rat and Human Orexin 1 Receptor:Human Embryonic Kidney 293 cells (HEK293) stably expressing rat orexin 1 receptor (Genebank accession number NM_00152...
In DepthDetails US Patent
TargetOrexin/Hypocretin receptor type 1(Homo sapiens (Human))
Janssen Pharmaceutica
US Patent
LigandPNGBDBM143753(US10183953, Example 43 | US8969352, 14 | US8969352...)
Affinity DataKi:  21nM. Assay description: CHO cells stably transfected with the human orexin 1 receptor (Genebank accession number NM_001526) were grown to confluency in DMEM/F12, 10% FBS, 1×...
In DepthDetails US Patent
TargetOrexin/Hypocretin receptor type 1(Homo sapiens (Human))
Janssen Pharmaceutica
US Patent
LigandPNGBDBM143753(US10183953, Example 43 | US8969352, 14 | US8969352...)
Affinity DataKi:  23nM. Assay description: CHO cells stably transfected with the human orexin 1 receptor (Genebank accession number NM_001526) were grown to confluency in DMEM/F12, 10% FBS, 1×...
In DepthDetails US Patent
TargetOrexin/Hypocretin receptor type 1(Homo sapiens (Human))
Janssen Pharmaceutica
US Patent
LigandPNGBDBM143753(US10183953, Example 43 | US8969352, 14 | US8969352...)
Affinity DataKi:  23nM. Assay description: HEK293 stably expressing human orexin 2 receptor (Genebank accession number NM_001526) were grown to confluency in DMEM (Hyclone, cat # SH30022), 10%...
In DepthDetails US Patent
TargetOrexin/Hypocretin receptor type 1(Rattus norvegicus (Rat))
Janssen Pharmaceutica
US Patent
LigandPNGBDBM143753(US10183953, Example 43 | US8969352, 14 | US8969352...)
Affinity DataKi:  24nM. Assay description: Human Embryonic Kidney 293 cells (HEK293) stably expressing rat orexin 1 receptor (Genebank accession number NM_001525) or Chinese ovary cells (CHO) ...
In DepthDetails US Patent
TargetOrexin/Hypocretin receptor type 1(Rattus norvegicus (Rat))
Janssen Pharmaceutica
US Patent
LigandPNGBDBM143753(US10183953, Example 43 | US8969352, 14 | US8969352...)
Affinity DataKi:  24nM. Assay description: Human Embryonic Kidney 293 cells (HEK293) stably expressing rat orexin 1 receptor (Genebank accession number NM_001525) or Chinese ovary cells (CHO) ...
In DepthDetails US Patent
TargetOrexin receptor type 2(Homo sapiens (Human))
Janssen Pharmaceutica
US Patent
LigandPNGBDBM143753(US10183953, Example 43 | US8969352, 14 | US8969352...)
Affinity DataKi:  550nM. Assay description: PFSK-1 cells endogenously expressing the human orexin 2 receptor were grown to confluency in RPMI1640 (Hyclone, cat #30027.02), 10% FBS, 1× pen-strep...
In DepthDetails US Patent
TargetOrexin receptor type 2(Homo sapiens (Human))
Janssen Pharmaceutica
US Patent
LigandPNGBDBM143753(US10183953, Example 43 | US8969352, 14 | US8969352...)
Affinity DataKi:  550nM. Assay description: HEK293 stably expressing human orexin 2 receptor (Genebank accession number NM_001526) were grown to confluency in DMEM (Hyclone, cat # SH30022), 10%...
In DepthDetails US Patent
TargetOrexin receptor type 2(Homo sapiens (Human))
Janssen Pharmaceutica
US Patent
LigandPNGBDBM143753(US10183953, Example 43 | US8969352, 14 | US8969352...)
Affinity DataKi:  557nM. Assay description: HEK293 stably expressing human orexin 2 receptor (Genebank accession number NM 001526) were grown to confluency in DMEM (Hyclone, cat # SH30022), 10%...
In DepthDetails US Patent
TargetOrexin receptor type 2(Rattus norvegicus (Rat))
TBA
US Patent
LigandPNGBDBM143753(US10183953, Example 43 | US8969352, 14 | US8969352...)
Affinity DataKi:  557nM. Assay description: Human Orexin 2 Receptor:HEK293 stably expressing human orexin 2 receptor (Genebank accession number NM_001526) were grown to confluency in DMEM (Hycl...
In DepthDetails US Patent
TargetOrexin receptor type 2(Homo sapiens (Human))
Janssen Pharmaceutica
US Patent
LigandPNGBDBM143753(US10183953, Example 43 | US8969352, 14 | US8969352...)
Affinity DataKi:  557nM. Assay description: HEK293 stably expressing human orexin 2 receptor (Genebank accession number NM_001526) were grown to confluency in DMEM (Hyclone, cat # SH30022), 10%...
In DepthDetails US Patent
TargetOrexin receptor type 2(Homo sapiens (Human))
Janssen Pharmaceutica
US Patent
LigandPNGBDBM143753(US10183953, Example 43 | US8969352, 14 | US8969352...)
Affinity DataKi:  557nM. Assay description: PFSK-1 cells endogenously expressing the human orexin 2 receptor were grown to confluency in RPMI1640 (Hyclone, cat #30027.02), 10% FBS, 1× pen-strep...
In DepthDetails US Patent
TargetOrexin receptor type 2(Homo sapiens (Human))
Janssen Pharmaceutica
US Patent
LigandPNGBDBM143753(US10183953, Example 43 | US8969352, 14 | US8969352...)
Affinity DataKi:  855nM. Assay description: HEK293 stably expressing human orexin 2 receptor (Genebank accession number NM 001526) were grown to confluency in DMEM (Hyclone, cat # SH30022), 10%...
In DepthDetails US Patent
TargetOrexin receptor type 2(Homo sapiens (Human))
Janssen Pharmaceutica
US Patent
LigandPNGBDBM143753(US10183953, Example 43 | US8969352, 14 | US8969352...)
Affinity DataKi:  855nM. Assay description: PFSK-1 cells endogenously expressing the human orexin 2 receptor were grown to confluency in RPMI1640 (Hyclone, cat #30027.02), 10% FBS, 1× pen-strep...
In DepthDetails US Patent
TargetOrexin receptor type 2(Homo sapiens (Human))
Janssen Pharmaceutica
US Patent
LigandPNGBDBM143753(US10183953, Example 43 | US8969352, 14 | US8969352...)
Affinity DataKi:  855nM. Assay description: HEK293 stably expressing human orexin 2 receptor (Genebank accession number NM_001526) were grown to confluency in DMEM (Hyclone, cat # SH30022), 10%...
In DepthDetails US Patent
TargetOrexin receptor type 2(Rattus norvegicus (Rat))
TBA
US Patent
LigandPNGBDBM143753(US10183953, Example 43 | US8969352, 14 | US8969352...)
Affinity DataKi:  855nM. Assay description: Human Orexin 2 Receptor:HEK293 stably expressing human orexin 2 receptor (Genebank accession number NM_001526) were grown to confluency in DMEM (Hycl...
In DepthDetails US Patent
TargetOrexin receptor type 2(Homo sapiens (Human))
Janssen Pharmaceutica
US Patent
LigandPNGBDBM143753(US10183953, Example 43 | US8969352, 14 | US8969352...)
Affinity DataKi:  882nM. Assay description: HEK293 stably expressing human orexin 2 receptor (Genebank accession number NM_001526) were grown to confluency in DMEM (Hyclone, cat # SH30022), 10%...
In DepthDetails US Patent
TargetOrexin receptor type 2(Homo sapiens (Human))
Janssen Pharmaceutica
US Patent
LigandPNGBDBM143753(US10183953, Example 43 | US8969352, 14 | US8969352...)
Affinity DataKi:  882nM. Assay description: PFSK-1 cells endogenously expressing the human orexin 2 receptor were grown to confluency in RPMI1640 (Hyclone, cat #30027.02), 10% FBS, 1× pen-strep...
In DepthDetails US Patent