BDBM150749 2-(4,5-Diphenyl-1H-imidazol-2-yl)-6-methoxyphenol (3g)
SMILES COc1cccc(-c2nc(c([nH]2)-c2ccccc2)-c2ccccc2)c1O
InChI Key InChIKey=FDJSTWWSLKIVSN-UHFFFAOYSA-N
Data  1 IC50
  Tab Delimited (TSV)   2D SDfile   Computed 3D by Vconf -m prep SDfile
Find this compound or compounds like it in BindingDB:
Activity Spreadsheet -- Enzyme Inhibition Constant Data from BindingDB
Found 1 hit for monomerid = 150749
TargetOligo-1,6-glucosidase IMA1(Saccharomyces cerevisiae S288c (Baker's yeast))
Comsats Institute Of Information Technology
LigandPNGBDBM150749(2-(4,5-Diphenyl-1H-imidazol-2-yl)-6-methoxyphenol ...)
Affinity DataIC50:  1.07E+5nMT: 2°C. Assay description: A 100 µL assay mixture containing 70 µL phosphate buffer saline (50 mM at pH 6.8), 10 µL corresponding test compounds dissolved in methanol/DMSO (0.5...
In DepthDetails ArticlePubMed