BDBM152424 (E)-5-[(2-Methylhydrazono)methyl]benzene-1,2,4-triol (11)
SMILES CN\N=C\c1cc(O)c(O)cc1O
InChI Key InChIKey=YICYLDQZWYSANX-ONNFQVAWSA-N
Data  1 KI
  Tab Delimited (TSV)   2D SDfile   Computed 3D by Vconf -m prep SDfile
Find this compound or compounds like it in BindingDB:
Activity Spreadsheet -- Enzyme Inhibition Constant Data from BindingDB
Found 1 hit for monomerid = 152424
Target1-deoxy-D-xylulose 5-phosphate reductoisomerase(Escherichia coli)
The Johns Hopkins University School Of Medicine
LigandPNGBDBM152424((E)-5-[(2-Methylhydrazono)methyl]benzene-1,2,4-tri...)
Affinity DataKi: >7.50E+4nMpH: 8.0Assay Description:DXP synthase reaction mixtures containing HEPES (100 mM, pH 8.0), MgCl2 (2 mM), NaCl (5 mM), ThDP (1 mM), BSA (1 mg/mL), pyruvate (12.5-250 µM), D-GA...
Ligand InfoPC cidPC sid
In DepthDetails ArticlePubMed