BDBM15780 6-Substituted 2-Aminopyridine 4::6-{2-[3-(3-methoxyphenyl)phenyl]ethyl}pyridin-2-amine
SMILES COc1cccc(c1)-c1cccc(CCc2cccc(N)n2)c1
InChI Key InChIKey=AEVBKBAFFJKFJZ-UHFFFAOYSA-N
Data  1 IC50
PDB links: 1 PDB ID matches this monomer.
  Tab Delimited (TSV)   2D SDfile   Computed 3D by Vconf -m prep SDfile
Find this compound or compounds like it in BindingDB:
Activity Spreadsheet -- Enzyme Inhibition Constant Data from BindingDB
Found 1 hit for monomerid = 15780
TargetBeta-secretase 1(Homo sapiens (Human))
Astex
LigandPNGBDBM15780(6-Substituted 2-Aminopyridine 4 | 6-{2-[3-(3-metho...)
Affinity DataIC50:  2.50E+4nMpH: 5.0 T: 2°C. Assay description: Activity of BACE-1 was measured by monitoring the cleavage of its peptide substrate on a Fluoroskan Ascent plate reader with excitation and emission ...