BDBM160152 US10047092, 93::US10053463, 93::US9040534, 93
SMILES CC(N1[C@@H](C)Cn2c(nnc2-c2cnccn2)C1=O)c1cccc(c1Cl)C(F)(F)F
InChI Key InChIKey=PQOXZIZSUXLDCI-VUWPPUDQSA-N
Data  6 KI  8 IC50
  Tab Delimited (TSV)   2D SDfile   Computed 3D by Vconf -m prep SDfile
Find this compound or compounds like it in BindingDB:
Activity Spreadsheet -- Enzyme Inhibition Constant Data from BindingDB
Found 14 hits for monomerid = 160152
TargetP2X purinoceptor 7(Mus musculus)
Janssen Pharmaceutica
US Patent
LigandPNGBDBM160152(US10047092, 93 | US10053463, 93 | US9040534, 93)
Affinity DataKi:  31.6nM. Assay description: human or rat P2X7-1321N1 cells were collected and frozen @−80° C. On the day of the experiment, cell membrane preparations were made according ...
In DepthDetails US Patent
TargetP2X purinoceptor 7(Rattus norvegicus (Rat))
Janssen Pharmaceutica
US Patent
LigandPNGBDBM160152(US10047092, 93 | US10053463, 93 | US9040534, 93)
Affinity DataKi:  31.6nM. Assay description: Radioligand binding: human or rat P2X7-1321N1 cells were collected and frozen @ −80° C. On the day of the experiment, cell membrane preparation...
In DepthDetails US Patent
TargetP2X purinoceptor 7(Rattus norvegicus (Rat))
Janssen Pharmaceutica
US Patent
LigandPNGBDBM160152(US10047092, 93 | US10053463, 93 | US9040534, 93)
Affinity DataKi:  31.6nM. Assay description: human or rat P2X7-1321N1 cells were collected and frozen @ −80° C. On the day of the experiment, cell membrane preparations were made according...
In DepthDetails US Patent
TargetP2X purinoceptor 7(Homo sapiens (Human))
Janssen Pharmaceutica
US Patent
LigandPNGBDBM160152(US10047092, 93 | US10053463, 93 | US9040534, 93)
Affinity DataKi:  158nM. Assay description: human or rat P2X7-1321N1 cells were collected and frozen @ −80° C. On the day of the experiment, cell membrane preparations were made according...
In DepthDetails US Patent
TargetP2X purinoceptor 7(Homo sapiens (Human))
Janssen Pharmaceutica
US Patent
LigandPNGBDBM160152(US10047092, 93 | US10053463, 93 | US9040534, 93)
Affinity DataKi:  158nM. Assay description: human or rat P2X7-1321N1 cells were collected and frozen @−80° C. On the day of the experiment, cell membrane preparations were made according ...
In DepthDetails US Patent
TargetP2X purinoceptor 7(Homo sapiens (Human))
Janssen Pharmaceutica
US Patent
LigandPNGBDBM160152(US10047092, 93 | US10053463, 93 | US9040534, 93)
Affinity DataKi:  159nM. Assay description: Radioligand binding: human or rat P2X7-1321N1 cells were collected and frozen @ −80° C. On the day of the experiment, cell membrane preparation...
In DepthDetails US Patent
TargetP2X purinoceptor 7(Mus musculus)
Janssen Pharmaceutica
US Patent
LigandPNGBDBM160152(US10047092, 93 | US10053463, 93 | US9040534, 93)
Affinity DataIC50:  3.05E+3nMpH: 7.4Assay Description:1321N1 cells expressing the recombinant human or rat P2X7 channel was cultured in HyQ DME/(HyClone/Dulbecco's Modified Eagle Medium) high glucose...
In DepthDetails US Patent
TargetP2X purinoceptor 7(Homo sapiens (Human))
Janssen Pharmaceutica
US Patent
LigandPNGBDBM160152(US10047092, 93 | US10053463, 93 | US9040534, 93)
Affinity DataIC50:  88.1nMpH: 7.4Assay Description:Ca2+ Flux: 1321N1 cells expressing the recombinant human, rat or mouse P2X7 channel was cultured in HyQ DME/(HyClone/Dulbecco's Modified Eagle Medium...
In DepthDetails US Patent
TargetP2X purinoceptor 7(Homo sapiens (Human))
Janssen Pharmaceutica
US Patent
LigandPNGBDBM160152(US10047092, 93 | US10053463, 93 | US9040534, 93)
Affinity DataIC50:  88.1nMpH: 7.4Assay Description:1321N1 cells expressing the recombinant human, rat or mouse P2X7 channel was cultured in HyQ DME/(HyClone/Dulbecco's Modified Eagle Medium) high ...
In DepthDetails US Patent
TargetP2X purinoceptor 7(Rattus norvegicus (Rat))
Janssen Pharmaceutica
US Patent
LigandPNGBDBM160152(US10047092, 93 | US10053463, 93 | US9040534, 93)
Affinity DataIC50:  3.05E+3nMpH: 7.4Assay Description:Ca2+ Flux: 1321N1 cells expressing the recombinant human, rat or mouse P2X7 channel was cultured in HyQ DME/(HyClone/Dulbecco's Modified Eagle Medium...
In DepthDetails US Patent
TargetP2X purinoceptor 7(Homo sapiens (Human))
Janssen Pharmaceutica
US Patent
LigandPNGBDBM160152(US10047092, 93 | US10053463, 93 | US9040534, 93)
Affinity DataIC50:  88.1nMpH: 7.4Assay Description:1321N1 cells expressing the recombinant human or rat P2X7 channel was cultured in HyQ DME/(HyClone/Dulbecco's Modified Eagle Medium) high glucose...
In DepthDetails US Patent
TargetP2X purinoceptor 7(Homo sapiens (Human))
Janssen Pharmaceutica
US Patent
LigandPNGBDBM160152(US10047092, 93 | US10053463, 93 | US9040534, 93)
Affinity DataIC50:  65nM. Assay description: Antagonist activity at human P2X7 receptor expressed in 1321N1 cells assessed as inhibition of Bz-ATP-induced Ca2+ flux after 30 mins by FLIPR assay
In DepthDetails ArticlePubMed
TargetP2X purinoceptor 7(Rattus norvegicus (Rat))
Janssen Pharmaceutica
US Patent
LigandPNGBDBM160152(US10047092, 93 | US10053463, 93 | US9040534, 93)
Affinity DataIC50:  2.69E+3nM. Assay description: Antagonist activity at rat P2X7 receptor expressed in 1321N1 cells assessed as inhibition of Bz-ATP-induced Ca2+ flux after 30 mins by FLIPR assay
In DepthDetails ArticlePubMed
TargetP2X purinoceptor 7(Rattus norvegicus (Rat))
Janssen Pharmaceutica
US Patent
LigandPNGBDBM160152(US10047092, 93 | US10053463, 93 | US9040534, 93)
Affinity DataIC50:  3.05E+3nMpH: 7.4Assay Description:1321N1 cells expressing the recombinant human, rat or mouse P2X7 channel was cultured in HyQ DME/(HyClone/Dulbecco's Modified Eagle Medium) high ...
In DepthDetails US Patent