BDBM16074 (2R,4S)-N-butyl-4-hydroxy-2-methyl-4-[(3R,6S,13Z)-6-methyl-5,8-dioxo-1,11-dithia-4,7-diazacyclopentadec-13-en-3-yl]butanamide::dithia macrocycle compound 34
SMILES CCCCNC(=O)[C@H](C)C[C@H](O)[C@@H]1CSC\C=C/CSCCC(=O)N[C@@H](C)C(=O)N1
InChI Key InChIKey=SZQXWWGPBYKSPP-PAXAMTNXSA-N
Data  2 IC50
  Tab Delimited (TSV)   2D SDfile   Computed 3D by Vconf -m prep SDfile
Find this compound or compounds like it in BindingDB:
Activity Spreadsheet -- Enzyme Inhibition Constant Data from BindingDB
Found 2 hits for monomerid = 16074
TargetCathepsin D(Homo sapiens (Human))
Universite De Montreal At Succursale Centre-Ville
LigandPNGBDBM16074((2R,4S)-N-butyl-4-hydroxy-2-methyl-4-[(3R,6S,13Z)-...)
Affinity DataIC50: >1.00E+4nMT: 2°C. Assay description: Inhibition assays were done in black 96-well plates by adding test compounds to the respective enzyme in assay buffer. Plates were incubated at room ...
In DepthDetails ArticlePubMed
TargetBeta-secretase 1 [1-453](Homo sapiens (Human))
Universite De Montreal At Succursale Centre-Ville
LigandPNGBDBM16074((2R,4S)-N-butyl-4-hydroxy-2-methyl-4-[(3R,6S,13Z)-...)
Affinity DataIC50: >1.00E+4nMpH: 4.5 T: 2°C. Assay description: Inhibition assays were done in black 96-well plates by adding test compounds to the respective enzyme in assay buffer. Plates were incubated at room ...
In DepthDetails ArticlePubMed