BDBM168150 US10081602, Example 24::US10865186, Compound 24::US9688638, 24
SMILES C[C@H]1[C@@H]2N(CC3CC3)CC[C@@]1(C)c1cc(NC(CO)CO)ccc1C2=O
InChI Key InChIKey=DZAXUMWVIDHSHQ-JBZDTAIVSA-N
Data  6 KI  4 EC50
  Tab Delimited (TSV)   2D SDfile   Computed 3D by Vconf -m prep SDfile
Find this compound or compounds like it in BindingDB:
Activity Spreadsheet -- Enzyme Inhibition Constant Data from BindingDB
Found 10 hits for monomerid = 168150
TargetKappa-type opioid receptor(Homo sapiens (Human))
Nektar Therapeutics
US Patent
LigandPNGBDBM168150(US10081602, Example 24 | US10865186, Compound 24 |...)
Affinity DataKi:  494nMpH: 7.5Assay Description:The binding affinities of certain compounds of the present invention were evaluated using radioligand binding assays in membranes prepared from CHO-K...
Ligand InfoPC cidPC sid
In DepthDetails US Patent
TargetKappa-type opioid receptor(Homo sapiens (Human))
Nektar Therapeutics
US Patent
LigandPNGBDBM168150(US10081602, Example 24 | US10865186, Compound 24 |...)
Affinity DataKi:  494nM ΔG°:  -8.60kcal/molepH: 7.5 T: 2°C. Assay description: Competition binding experiments were conducted by incubating membrane protein to equilibrium in triplicate in the presence of a fixed concentration o...
Ligand InfoPC cidPC sid
In DepthDetails US Patent
TargetKappa-type opioid receptor(Homo sapiens (Human))
Nektar Therapeutics
US Patent
LigandPNGBDBM168150(US10081602, Example 24 | US10865186, Compound 24 |...)
Affinity DataKi:  494nM. Assay description: The binding affinities of certain compounds of the present invention were evaluated using radioligand binding assays in membranes prepared from CHO-K...
Ligand InfoPC cidPC sid
In DepthDetails US Patent
TargetMu-type opioid receptor(Homo sapiens (Human))
Nektar Therapeutics
US Patent
LigandPNGBDBM168150(US10081602, Example 24 | US10865186, Compound 24 |...)
Affinity DataKi:  1.81E+3nM
Ligand InfoPC cidPC sid
In DepthDetails US Patent
TargetMu-type opioid receptor(Homo sapiens (Human))
Nektar Therapeutics
US Patent
LigandPNGBDBM168150(US10081602, Example 24 | US10865186, Compound 24 |...)
Affinity DataKi:  1.81E+3nM ΔG°:  -7.83kcal/molepH: 7.5 T: 2°C. Assay description: Competition binding experiments were conducted by incubating membrane protein to equilibrium in triplicate in the presence of a fixed concentration o...
Ligand InfoPC cidPC sid
In DepthDetails US Patent
TargetMu-type opioid receptor(Homo sapiens (Human))
Nektar Therapeutics
US Patent
LigandPNGBDBM168150(US10081602, Example 24 | US10865186, Compound 24 |...)
Affinity DataKi:  1.81E+3nMpH: 7.5Assay Description:The binding affinities of certain compounds of the present invention were evaluated using radioligand binding assays in membranes prepared from CHO-K...
Ligand InfoPC cidPC sid
In DepthDetails US Patent
TargetMu-type opioid receptor(Homo sapiens (Human))
Nektar Therapeutics
US Patent
LigandPNGBDBM168150(US10081602, Example 24 | US10865186, Compound 24 |...)
Affinity DataEC50:  598nM. Assay description: Inhibition of cAMP accumulation by select compounds was measured in forskolin-stimulated CHO-K1 cells stably expressing KOR. CHO-K1 cells stably expr...
Ligand InfoPC cidPC sid
In DepthDetails US Patent
TargetKappa-type opioid receptor(Homo sapiens (Human))
Nektar Therapeutics
US Patent
LigandPNGBDBM168150(US10081602, Example 24 | US10865186, Compound 24 |...)
Affinity DataEC50:  107nM. Assay description: Inhibition of cAMP accumulation by select compounds was measured in forskolin-stimulated CHO-K1 cells stably expressing KOR. CHO-K1 cells stably expr...
Ligand InfoPC cidPC sid
In DepthDetails US Patent
TargetMu-type opioid receptor(Homo sapiens (Human))
Nektar Therapeutics
US Patent
LigandPNGBDBM168150(US10081602, Example 24 | US10865186, Compound 24 |...)
Affinity DataEC50:  580nM. Assay description: Inhibition of cAMP accumulation by select compounds was measured in forskolin-stimulated CHO-K1 cells stably expressing KOR. CHO-K1 cells stably expr...
Ligand InfoPC cidPC sid
In DepthDetails US Patent
TargetKappa-type opioid receptor(Homo sapiens (Human))
Nektar Therapeutics
US Patent
LigandPNGBDBM168150(US10081602, Example 24 | US10865186, Compound 24 |...)
Affinity DataEC50:  107nM. Assay description: Inhibition of cAMP accumulation by select compounds was measured in forskolin-stimulated CHO-K1 cells stably expressing KOR. CHO-K1 cells stably expr...
Ligand InfoPC cidPC sid
In DepthDetails US Patent