BDBM17130 3-chloro-N-{4-chloro-2-[(5-chloropyridin-2-yl)carbamoyl]-6-methoxyphenyl}-4-[(N-methylethanimidamido)methyl]thiophene-2-carboxamide::Thiophene-Anthranilamide, 17h
SMILES COc1cc(Cl)cc(C(=O)Nc2ccc(Cl)cn2)c1NC(=O)c1scc(CN(C)C(C)=N)c1Cl
InChI Key InChIKey=JKXFAJKKAORNCV-UHFFFAOYSA-N
Data  2 KI
  Tab Delimited (TSV)   2D SDfile   Computed 3D by Vconf -m prep SDfile
Find this compound or compounds like it in BindingDB:
Activity Spreadsheet -- Enzyme Inhibition Constant Data from BindingDB
Found 2 hits for monomerid = 17130
TargetCoagulation factor X(Homo sapiens (Human))
Berlex Biosciences
LigandPNGBDBM17130(3-chloro-N-{4-chloro-2-[(5-chloropyridin-2-yl)carb...)
Affinity DataKi:  0.0100nM. Assay description: The enzyme activities were determined kinetically as the initial rate of cleavage of a peptide p-nitroanilide. Km for enzyme and substrate was determ...
In DepthDetails ArticlePubMed
TargetProthrombin(Homo sapiens (Human))
Berlex Biosciences
LigandPNGBDBM17130(3-chloro-N-{4-chloro-2-[(5-chloropyridin-2-yl)carb...)
Affinity DataKi:  920nM. Assay description: The enzyme activities were determined kinetically as the initial rate of cleavage of a peptide p-nitroanilide. Km for enzyme and substrate was determ...
In DepthDetails ArticlePubMed