BDBM173258 US10323032, Example 10::US9096596, 10::US9604982, Example 10
SMILES Cc1c(cccc1C(F)(F)F)C(=O)N1CCc2c(C1)ncnc2-c1ccn[nH]1
InChI Key InChIKey=HSTYOIFAPJGPSV-UHFFFAOYSA-N
Data  8 KI  8 IC50
  Tab Delimited (TSV)   2D SDfile   Computed 3D by Vconf -m prep SDfile
Find this compound or compounds like it in BindingDB:
Activity Spreadsheet -- Enzyme Inhibition Constant Data from BindingDB
Found 16 hits for monomerid = 173258
TargetP2X purinoceptor 7(Rattus norvegicus (Rat))
Janssen Pharmaceutica
US Patent
LigandPNGBDBM173258(US10323032, Example 10 | US9096596, 10 | US9604982...)
Affinity DataKi:  21.9nM. Assay description: Human or rat P2X7-1321 N1 cells were collected and frozen @−80° C. On the day of the experiment, cell membrane preparations were made according...
In DepthDetails US Patent
TargetP2X purinoceptor 7(Rattus norvegicus (Rat))
Janssen Pharmaceutica
US Patent
LigandPNGBDBM173258(US10323032, Example 10 | US9096596, 10 | US9604982...)
Affinity DataKi:  21.9nM. Assay description: 1321N1 cells expressing the recombinant human or rat P2X7 channel was cultured in HyQ DME/(HyClone/Dulbecco's Modified Eagle Medium) high glucose...
In DepthDetails US Patent
TargetP2X purinoceptor 7(Rattus norvegicus (Rat))
Janssen Pharmaceutica
US Patent
LigandPNGBDBM173258(US10323032, Example 10 | US9096596, 10 | US9604982...)
Affinity DataKi:  21.9nM. Assay description: 1321N1 cells expressing the recombinant human or rat P2X7 channel was cultured in HyQ DME/(HyClone/Dulbecco's Modified Eagle Medium) high glucose...
In DepthDetails US Patent
TargetP2X purinoceptor 7(Rattus norvegicus (Rat))
Janssen Pharmaceutica
US Patent
LigandPNGBDBM173258(US10323032, Example 10 | US9096596, 10 | US9604982...)
Affinity DataKi:  21.9nM. Assay description: human or rat P2X7-1321N1 cells were collected and frozen @ −80° C. On the day of the experiment, cell membrane preparations were made according...
In DepthDetails US Patent
TargetP2X purinoceptor 7(Homo sapiens (Human))
Janssen Pharmaceutica
US Patent
LigandPNGBDBM173258(US10323032, Example 10 | US9096596, 10 | US9604982...)
Affinity DataKi:  30.9nM. Assay description: human or rat P2X7-1321N1 cells were collected and frozen @ −80° C. On the day of the experiment, cell membrane preparations were made according...
In DepthDetails US Patent
TargetP2X purinoceptor 7(Homo sapiens (Human))
Janssen Pharmaceutica
US Patent
LigandPNGBDBM173258(US10323032, Example 10 | US9096596, 10 | US9604982...)
Affinity DataKi:  30.9nM. Assay description: Human or rat P2X7-1321 N1 cells were collected and frozen @−80° C. On the day of the experiment, cell membrane preparations were made according...
In DepthDetails US Patent
TargetP2X purinoceptor 7(Homo sapiens (Human))
Janssen Pharmaceutica
US Patent
LigandPNGBDBM173258(US10323032, Example 10 | US9096596, 10 | US9604982...)
Affinity DataKi:  30.9nM. Assay description: Human or rat P2X7-1321N1 cells were collected and frozen @ −80° C. On the day of the experiment, cell membrane preparations were made according...
In DepthDetails US Patent
TargetP2X purinoceptor 7(Homo sapiens (Human))
Janssen Pharmaceutica
US Patent
LigandPNGBDBM173258(US10323032, Example 10 | US9096596, 10 | US9604982...)
Affinity DataKi:  30.9nM. Assay description: Human or rat P2X7-1321N1 cells were collected and frozen @ −80° C. On the day of the experiment, cell membrane preparations were made according...
In DepthDetails US Patent
TargetP2X purinoceptor 7(Homo sapiens (Human))
Janssen Pharmaceutica
US Patent
LigandPNGBDBM173258(US10323032, Example 10 | US9096596, 10 | US9604982...)
Affinity DataIC50:  46.1nM. Assay description: 1321N1 cells expressing the recombinant human or rat P2X7 channel was cultured in HyQ DME/(HyClone/Dulbecco's Modified Eagle Medium) high glucose...
In DepthDetails US Patent
TargetP2X purinoceptor 7(Rattus norvegicus (Rat))
Janssen Pharmaceutica
US Patent
LigandPNGBDBM173258(US10323032, Example 10 | US9096596, 10 | US9604982...)
Affinity DataIC50:  1.01E+3nM. Assay description: Human or rat P2X7-1321N1 cells were collected and frozen @ −80° C. On the day of the experiment, cell membrane preparations were made according...
In DepthDetails US Patent
TargetP2X purinoceptor 7(Homo sapiens (Human))
Janssen Pharmaceutica
US Patent
LigandPNGBDBM173258(US10323032, Example 10 | US9096596, 10 | US9604982...)
Affinity DataIC50:  46.1nM. Assay description: 1321N1 cells expressing the recombinant human or rat P2X7 channel was cultured in HyQ DME/(HyClone/Dulbecco's Modified Eagle Medium) high glucose...
In DepthDetails US Patent
TargetP2X purinoceptor 7(Rattus norvegicus (Rat))
Janssen Pharmaceutica
US Patent
LigandPNGBDBM173258(US10323032, Example 10 | US9096596, 10 | US9604982...)
Affinity DataIC50:  1.01E+3nM. Assay description: 1321N1 cells expressing the recombinant human or rat P2X7 channel was cultured in HyQ DME/(HyClone/Dulbecco's Modified Eagle Medium) high glucose...
In DepthDetails US Patent
TargetP2X purinoceptor 7(Homo sapiens (Human))
Janssen Pharmaceutica
US Patent
LigandPNGBDBM173258(US10323032, Example 10 | US9096596, 10 | US9604982...)
Affinity DataIC50:  46.1nM. Assay description: 1321N1 cells expressing the recombinant human or rat P2X7 channel was cultured in HyQ DME/(HyClone/Dulbecco's Modified Eagle Medium) high glucose...
In DepthDetails US Patent
TargetP2X purinoceptor 7(Rattus norvegicus (Rat))
Janssen Pharmaceutica
US Patent
LigandPNGBDBM173258(US10323032, Example 10 | US9096596, 10 | US9604982...)
Affinity DataIC50:  1.01E+3nMpH: 7.4Assay Description:1321N1 cells expressing the recombinant human, rat or mouse P2X7 channel was cultured in HyQ DME/(HyClone/Dulbecco's Modified Eagle Medium) high gluc...
In DepthDetails US Patent
TargetP2X purinoceptor 7(Homo sapiens (Human))
Janssen Pharmaceutica
US Patent
LigandPNGBDBM173258(US10323032, Example 10 | US9096596, 10 | US9604982...)
Affinity DataIC50:  46.1nMpH: 7.4Assay Description:1321N1 cells expressing the recombinant human, rat or mouse P2X7 channel was cultured in HyQ DME/(HyClone/Dulbecco's Modified Eagle Medium) high gluc...
In DepthDetails US Patent
TargetP2X purinoceptor 7(Rattus norvegicus (Rat))
Janssen Pharmaceutica
US Patent
LigandPNGBDBM173258(US10323032, Example 10 | US9096596, 10 | US9604982...)
Affinity DataIC50:  1.01E+3nM. Assay description: Human or rat P2X7-1321N1 cells were collected and frozen @ −80° C. On the day of the experiment, cell membrane preparations were made according...
In DepthDetails US Patent