BDBM175349 4'-Isopropyl Benzofuranone (4'-CH(CH3)2)::6-Hydroxy-2-(4'-isopropylbenzylidene)benzofuran-3(2H)-one
SMILES CC(C)c1cccc2OC(=O)Cc12
InChI Key InChIKey=RGYVWEBFPZZOEK-UHFFFAOYSA-N
Data  1 KI  1 IC50
  Tab Delimited (TSV)   2D SDfile   Computed 3D by Vconf -m prep SDfile
Find this compound or compounds like it in BindingDB:
Activity Spreadsheet -- Enzyme Inhibition Constant Data from BindingDB
Found 1 hit for monomerid = 175349
TargetAldehyde oxidase 1(Cavia porcellus (Guinea pig))
Kermanshah University Of Medical Sciences
LigandPNGBDBM175349(4'-Isopropyl Benzofuranone (4'-CH(CH3)2) |...)
Affinity DataKi:  4.80E+4nM IC50:  4.94E+4nMpH: 7.0Assay Description:Guinea pig AO activity was assayed spectrophotometrically using phenanthridine as a substrate at 322 nm. All spectrophotometric determinations were c...
Ligand InfoPC cidPC sid
In DepthDetails ArticlePubMed