BDBM175378 8-[3-{2-(Diethylaminoethylamino)-2-oxoethoxy}-phenyl]-1,3-dimethylxanthine (14b, RB-378)
SMILES CCN(CC)CCNC(=O)COc1cccc(c1)-c1nc2n(C)c(=O)n(C)c(=O)c2[nH]1
InChI Key InChIKey=SBNHYDQELDLRRV-UHFFFAOYSA-N
Data  4 KI
  Tab Delimited (TSV)   2D SDfile   Computed 3D by Vconf -m prep SDfile
Find this compound or compounds like it in BindingDB:
Activity Spreadsheet -- Enzyme Inhibition Constant Data from BindingDB
Found 4 hits for monomerid = 175378
TargetAdenosine receptor A2a(Homo sapiens (Human))
Panjab University
LigandPNGBDBM175378(8-[3-{2-(Diethylaminoethylamino)-2-oxoethoxy}-phen...)
Affinity DataKi:  179nM. Assay description: Dissociation constants at A1, A2A and A3 receptors (Ki-values) were determined in radioligand competition experiments as reported earlier [19,20]. Al...
In DepthDetails ArticlePubMed
TargetAdenosine receptor A1(Homo sapiens (Human))
Panjab University
LigandPNGBDBM175378(8-[3-{2-(Diethylaminoethylamino)-2-oxoethoxy}-phen...)
Affinity DataKi:  1.22E+3nM. Assay description: Dissociation constants at A1, A2A and A3 receptors (Ki-values) were determined in radioligand competition experiments as reported earlier [19,20]. Al...
In DepthDetails ArticlePubMed
TargetAdenosine receptor A2b(Homo sapiens (Human))
Panjab University
LigandPNGBDBM175378(8-[3-{2-(Diethylaminoethylamino)-2-oxoethoxy}-phen...)
Affinity DataKi:  4.91E+3nM. Assay description: Dissociation constants at A1, A2A and A3 receptors (Ki-values) were determined in radioligand competition experiments as reported earlier [19,20]. Al...
In DepthDetails ArticlePubMed
TargetAdenosine receptor A3 [I248L](Homo sapiens (Human))
Panjab University
LigandPNGBDBM175378(8-[3-{2-(Diethylaminoethylamino)-2-oxoethoxy}-phen...)
Affinity DataKi:  8.39E+3nM. Assay description: Dissociation constants at A1, A2A and A3 receptors (Ki-values) were determined in radioligand competition experiments as reported earlier [19,20]. Al...
In DepthDetails ArticlePubMed