BDBM181004 US9133187, II-359
SMILES Fc1cc(ccc1Cl)[C@H](NC(=O)N1CCc2cnc(NC3CCOCC3)nc2C1)c1nnco1
InChI Key InChIKey=QKCQGYTXJABCGH-IBGZPJMESA-N
Data  1 IC50
  Tab Delimited (TSV)   2D SDfile   Computed 3D by Vconf -m prep SDfile
Find this compound or compounds like it in BindingDB:
Activity Spreadsheet -- Enzyme Inhibition Constant Data from BindingDB
Found 1 hit for monomerid = 181004
TargetMitogen-activated protein kinase 1(Homo sapiens (Human))
Array Biopharma
US Patent
LigandPNGBDBM181004(US9133187, II-359)
Affinity DataIC50:  2.40nMpH: 7.3Assay Description:Compounds were tested in an enzymatic assay using human ERK-2 (Mitogen Activated Kinase 1), recombinantly expressed as an n-terminal 6-His fusion pro...
In DepthDetails US Patent