BDBM18231 2,4-diamino-5-deazapteridine, 2::7-[3-({2,4-diamino-5-methylpyrido[2,3-d]pyrimidin-6-yl}methyl)-4-methoxyphenyl]hept-6-ynoic acid::Piritrexim analogue, 12
SMILES COc1ccc(cc1Cc1cnc2nc(N)nc(N)c2c1C)C#CCCCCC(O)=O
InChI Key InChIKey=KGIGVDGEORZUCT-UHFFFAOYSA-N
Data  5 IC50
  Tab Delimited (TSV)   2D SDfile   Computed 3D by Vconf -m prep SDfile
Find this compound or compounds like it in BindingDB:
Activity Spreadsheet -- Enzyme Inhibition Constant Data from BindingDB
Found 5 hits for monomerid = 18231
TargetDihydrofolate reductase(Pneumocystis carinii)
Harvard Medical School
LigandPNGBDBM18231(2,4-diamino-5-deazapteridine, 2 | 7-[3-({2,4-diami...)
Affinity DataIC50:  1.80nMpH: 7.4 T: 2°C. Assay description: Dihydrofolate reductase was assayed with no inhibitor and with a series of concentrations of inhibitors to allow for a range of inhibition from 10 to...
In DepthDetails ArticlePubMed
TargetBifunctional dihydrofolate reductase-thymidylate synthase(Toxoplasma gondii)
Harvard Medical School
LigandPNGBDBM18231(2,4-diamino-5-deazapteridine, 2 | 7-[3-({2,4-diami...)
Affinity DataIC50:  3.20nM. Assay description: Dihydrofolate reductase was assayed with no inhibitor and with a series of concentrations of inhibitors to allow for a range of inhibition from 10 to...
In DepthDetails ArticlePubMed
TargetDihydrofolate reductase(Bacillus cereus (ATCC 14579))
University Of Connecticut At Storrs
LigandPNGBDBM18231(2,4-diamino-5-deazapteridine, 2 | 7-[3-({2,4-diami...)
Affinity DataIC50:  270nMpH: 7.0 T: 2°C. Assay description: Enzyme activity assays were performed by monitoring the rate of enzyme-dependent NADPH consumption at an absorbance of 340 nm over a period of severa...
In DepthDetails ArticlePubMed
TargetDihydrofolate reductase(Rattus norvegicus (rat))
Harvard Medical School
LigandPNGBDBM18231(2,4-diamino-5-deazapteridine, 2 | 7-[3-({2,4-diami...)
Affinity DataIC50:  4nM. Assay description: Dihydrofolate reductase was assayed with no inhibitor and with a series of concentrations of inhibitors to allow for a range of inhibition from 10 to...
In DepthDetails ArticlePubMed
TargetDihydrofolate reductase(Mycobacterium avium)
Harvard Medical School
LigandPNGBDBM18231(2,4-diamino-5-deazapteridine, 2 | 7-[3-({2,4-diami...)
Affinity DataIC50:  0.690nM. Assay description: Dihydrofolate reductase was assayed with no inhibitor and with a series of concentrations of inhibitors to allow for a range of inhibition from 10 to...
In DepthDetails ArticlePubMed