BDBM184295 US9150577, 171
SMILES C[C@@H]1NC(=O)c2cc3ccc(cc3n2[C@@H]1C)C(=O)Nc1cc(C)on1
InChI Key InChIKey=AMQAOXDPHJIPPA-WDEREUQCSA-N
Data  1 IC50
  Tab Delimited (TSV)   2D SDfile   Computed 3D by Vconf -m prep SDfile
Find this compound or compounds like it in BindingDB:
Activity Spreadsheet -- Enzyme Inhibition Constant Data from BindingDB
Found 1 hit for monomerid = 184295
TargetRibosomal protein S6 kinase alpha-2(Homo sapiens (Human))
Boehringer Ingelheim International
US Patent
LigandPNGBDBM184295(US9150577, 171)
Affinity DataIC50:  4nMpH: 7.5Assay Description:Human RSK2 protein, purchased from Invitrogen, is used to measure kinase activity utilizing Kinase Glo Plus (Promega) a homogeneous assay technology,...
In DepthDetails US Patent