BDBM18494 3-(2,4-diamino-6-methylpyrimidin-5-yl)-1-(3,4,5-trimethoxyphenyl)prop-2-yn-1-ol::JMC517532 Compound 9::Propargyl-linked, 7::Propargyl-substituted antifolate, 9::TMP derivative with propargyl-based linker, 25
SMILES COc1cc(cc(OC)c1OC)C(O)C#Cc1c(C)nc(N)nc1N
InChI Key InChIKey=MRGVCWULZNEIIL-UHFFFAOYSA-N
Data  1 KI  11 IC50
PDB links: 1 PDB ID matches this monomer.
  Tab Delimited (TSV)   2D SDfile   Computed 3D by Vconf -m prep SDfile
Find this compound or compounds like it in BindingDB:
Activity Spreadsheet -- Enzyme Inhibition Constant Data from BindingDB
Found 12 hits for monomerid = 18494
TargetDihydrofolate reductase(Bacillus anthracis)
University Of Connecticut
Curated by ChEMBL
LigandPNGBDBM18494(3-(2,4-diamino-6-methylpyrimidin-5-yl)-1-(3,4,5-tr...)
Affinity DataKi:  4.89E+3nM. Assay description: Inhibition of wild type Bacillus anthracis recombinant DHFR
TargetBifunctional dihydrofolate reductase-thymidylate synthase(Toxoplasma gondii)
Dartmouth College
LigandPNGBDBM18494(3-(2,4-diamino-6-methylpyrimidin-5-yl)-1-(3,4,5-tr...)
Affinity DataIC50:  9.10E+3nMpH: 7.0 T: 2°C. Assay description: Enzyme activity assays were performed by monitoring the rate of enzyme-dependent NADPH consumption at an absorbance of 340 nm over a period of severa...
In DepthDetails ArticlePubMed
TargetDihydrofolate reductase(Bacillus anthracis)
University Of Connecticut
Curated by ChEMBL
LigandPNGBDBM18494(3-(2,4-diamino-6-methylpyrimidin-5-yl)-1-(3,4,5-tr...)
Affinity DataIC50:  1.45E+4nMpH: 7.0 T: 2°C. Assay description: Enzyme activity assays were performed by monitoring the rate of enzyme-dependent NADPH oxidation at an absorbance of 340 nm over several minutes. All...
TargetDihydrofolate reductase(Homo sapiens (Human))
University Of Connecticut
LigandPNGBDBM18494(3-(2,4-diamino-6-methylpyrimidin-5-yl)-1-(3,4,5-tr...)
Affinity DataIC50:  5.71E+3nM. Assay description: Enzyme activity assays were performed by monitoring the rate of enzyme-dependent NADPH oxidation at an absorbance of 340 nm over several minutes. All...
In DepthDetails ArticlePubMed
TargetDihydrofolate reductase(Homo sapiens (Human))
University Of Connecticut
LigandPNGBDBM18494(3-(2,4-diamino-6-methylpyrimidin-5-yl)-1-(3,4,5-tr...)
Affinity DataIC50:  5.71E+3nMT: 2°C. Assay description: Enzyme inhibition assay using CgDHFR and hDHFR performed at 25 degree Celsius by monitoring the rate of enzyme-dependent NADPH oxidation at an absorb...
In DepthDetails ArticlePubMed
TargetDihydrofolate reductase(Bacillus anthracis)
University Of Connecticut
Curated by ChEMBL
LigandPNGBDBM18494(3-(2,4-diamino-6-methylpyrimidin-5-yl)-1-(3,4,5-tr...)
Affinity DataIC50:  1.45E+4nM. Assay description: Inhibition of wild type Bacillus anthracis recombinant DHFR
TargetDihydrofolate reductase(Candida Glabrata)
University Of Connecticut
LigandPNGBDBM18494(3-(2,4-diamino-6-methylpyrimidin-5-yl)-1-(3,4,5-tr...)
Affinity DataIC50:  39nM. Assay description: Enzyme activity assay were performed by monitoring the rate of enzyme-dependent NADPH consumption at an absorbance of 340 nm over 5 min.
In DepthDetails ArticlePubMed
TargetDihydrofolate reductase(Homo sapiens (Human))
University Of Connecticut
LigandPNGBDBM18494(3-(2,4-diamino-6-methylpyrimidin-5-yl)-1-(3,4,5-tr...)
Affinity DataIC50:  5.71E+3nM. Assay description: Enzyme activity assay were performed by monitoring the rate of enzyme-dependent NADPH consumption at an absorbance of 340 nm over 5 min.
In DepthDetails ArticlePubMed
TargetDihydrofolate reductase(Homo sapiens (Human))
University Of Connecticut
LigandPNGBDBM18494(3-(2,4-diamino-6-methylpyrimidin-5-yl)-1-(3,4,5-tr...)
Affinity DataIC50:  5.71E+3nM. Assay description: Inhibition of human DHFR assessed as rate of NADPH consumption using dihydrofolate as susbtrate
In DepthDetails ArticlePubMed
TargetDihydrofolate reductase(Candida albicans)
University Of Connecticut
Curated by ChEMBL
LigandPNGBDBM18494(3-(2,4-diamino-6-methylpyrimidin-5-yl)-1-(3,4,5-tr...)
Affinity DataIC50:  980nM. Assay description: Inhibition of Candida albicans DHFR expressed in Escherichia coli BL21 (DE3) assessed as rate of NADPH consumption using dihydrofolate as susbtrate
In DepthDetails ArticlePubMed
TargetBifunctional dihydrofolate reductase-thymidylate synthase(Cryptosporidium hominis)
Dartmouth College
LigandPNGBDBM18494(3-(2,4-diamino-6-methylpyrimidin-5-yl)-1-(3,4,5-tr...)
Affinity DataIC50:  1.41E+5nMpH: 7.0 T: 2°C. Assay description: Enzyme activity assays were performed by monitoring the rate of enzyme-dependent NADPH consumption at an absorbance of 340 nm over a period of severa...
In DepthDetails ArticlePubMed
TargetDihydrofolate reductase(Candida Glabrata)
University Of Connecticut
LigandPNGBDBM18494(3-(2,4-diamino-6-methylpyrimidin-5-yl)-1-(3,4,5-tr...)
Affinity DataIC50:  39nMT: 2°C. Assay description: Enzyme inhibition assay using CgDHFR and hDHFR performed at 25 degree Celsius by monitoring the rate of enzyme-dependent NADPH oxidation at an absorb...
In DepthDetails ArticlePubMed