BDBM185696 UNC10108017::US9156822, 40
SMILES O=C1CCc2ccc(OCCCCN3CCN(CC3)c3cccc4OCCOc34)cc2N1
InChI Key InChIKey=AMAZFBCTWBJQKF-UHFFFAOYSA-N
Data  1 KI  1 EC50
  Tab Delimited (TSV)   2D SDfile   Computed 3D by Vconf -m prep SDfile
Find this compound or compounds like it in BindingDB:
Activity Spreadsheet -- Enzyme Inhibition Constant Data from BindingDB
Found 2 hits for monomerid = 185696
TargetD(2) dopamine receptor(Homo sapiens (Human))
University Of North Carolina At Chapel Hill
US Patent
LigandPNGBDBM185696(UNC10108017 | US9156822, 40)
Affinity DataKi:  0.300nMpH: 7.4Assay Description:Membranes prepared as above were resuspended to 1 ug protein/ul (measured by Bradford assay using BSA as standard), and 50 ul were added to each well...
In DepthDetails US Patent
TargetD(2) dopamine receptor(Homo sapiens (Human))
University Of North Carolina At Chapel Hill
US Patent
LigandPNGBDBM185696(UNC10108017 | US9156822, 40)
Affinity DataEC50:  1.5nMpH: 7.4Assay Description:Recruitment of β-arrestin to agonist-stimulated D2 receptors was performed using a previously described Tango-type assay (Barnea et al., Proc. N...
In DepthDetails US Patent