BDBM18929 2-{3,5-dichloro-4-[4-hydroxy-3-(2-hydroxyphenyl)phenoxy]phenyl}acetic acid::4-hydroxy thyromimetic, 9k
SMILES OC(=O)Cc1cc(Cl)c(Oc2ccc(O)c(c2)-c2ccccc2O)c(Cl)c1
InChI Key InChIKey=SUVVBULKISMRAD-UHFFFAOYSA-N
Data  5 IC50
  Tab Delimited (TSV)   2D SDfile   Computed 3D by Vconf -m prep SDfile
Find this compound or compounds like it in BindingDB:
Activity Spreadsheet -- Enzyme Inhibition Constant Data from BindingDB
Found 5 hits for monomerid = 18929
TargetThyroid hormone receptor alpha(Homo sapiens (Human))
Bristol-Myers Squibb
LigandPNGBDBM18929(2-{3,5-dichloro-4-[4-hydroxy-3-(2-hydroxyphenyl)ph...)
Affinity DataIC50:  1.05E+3nMpH: 7.0 T: 2°C. Assay description: IC50 is the concentration of each compound required to inhibit 50% binding of 125I-T3 to hTRalpha.
In DepthDetails ArticlePubMed
TargetThyroid hormone receptor beta(Homo sapiens (Human))
Bristol-Myers Squibb
LigandPNGBDBM18929(2-{3,5-dichloro-4-[4-hydroxy-3-(2-hydroxyphenyl)ph...)
Affinity DataIC50:  50nM. Assay description: IC50 is the concentration of each compound required to inhibit 50% binding of 125I-T3 to hTRbeta.
In DepthDetails ArticlePubMed
TargetThyroid hormone receptor alpha(Homo sapiens (Human))
Bristol-Myers Squibb
LigandPNGBDBM18929(2-{3,5-dichloro-4-[4-hydroxy-3-(2-hydroxyphenyl)ph...)
Affinity DataIC50:  1.05E+3nM. Assay description: Inhibition of thyroid hormone receptor alpha
In DepthDetails ArticlePubMed
TargetThyroid hormone receptor beta(Homo sapiens (Human))
Bristol-Myers Squibb
LigandPNGBDBM18929(2-{3,5-dichloro-4-[4-hydroxy-3-(2-hydroxyphenyl)ph...)
Affinity DataIC50:  50.1nM. Assay description: Inhibition of thyroid hormone receptor beta
In DepthDetails ArticlePubMed
TargetThyroid hormone receptor beta(Homo sapiens (Human))
Bristol-Myers Squibb
LigandPNGBDBM18929(2-{3,5-dichloro-4-[4-hydroxy-3-(2-hydroxyphenyl)ph...)
Affinity DataIC50:  50.1nM. Assay description: Inhibition of human thyroid hormone receptor beta 1
In DepthDetails ArticlePubMed