BDBM192467 US10800746, Example WO 2011/104322 101::US9187466, 101::US9687476, 101
SMILES O[C@@H](Cn1c(nn(Cc2cn(nn2)-c2ccccc2Cl)c1=O)-c1ccc(Cl)cc1)C(F)(F)F
InChI Key InChIKey=QPLODKRMOCTZCR-KRWDZBQOSA-N
Data  6 IC50
  Tab Delimited (TSV)   2D SDfile   Computed 3D by Vconf -m prep SDfile
Find this compound or compounds like it in BindingDB:
Activity Spreadsheet -- Enzyme Inhibition Constant Data from BindingDB
Found 6 hits for monomerid = 192467
TargetVasopressin V1a receptor(Homo sapiens (Human))
Bayer Intellectual Property
US Patent
LigandPNGBDBM192467(US10800746, Example WO 2011/104322 101 | US9187466...)
Affinity DataIC50:  27nM. Assay description: On the day before the assay, the cells are plated out in culture medium (DMEM, 10% FCS, 2 mM glutamine, 10 mM HEPES) in 384-well microtiter plates an...
In DepthDetails US Patent
TargetVasopressin V2 receptor(Homo sapiens (Human))
Bayer Intellectual Property
US Patent
LigandPNGBDBM192467(US10800746, Example WO 2011/104322 101 | US9187466...)
Affinity DataIC50:  4.40nM. Assay description: On the day before the assay, the cells are plated out in culture medium (DMEM, 10% FCS, 2 mM glutamine, 10 mM HEPES) in 384-well microtiter plates an...
In DepthDetails US Patent
TargetVasopressin V2 receptor(Homo sapiens (Human))
Bayer Intellectual Property
US Patent
LigandPNGBDBM192467(US10800746, Example WO 2011/104322 101 | US9187466...)
Affinity DataIC50:  23.8nM. Assay description: The identification of agonists and antagonists of the V1a and V2 vasopressin receptors from humans, rats and dogs as well as the quantification of th...
In DepthDetails US Patent
TargetVasopressin V2 receptor(Homo sapiens (Human))
Bayer Intellectual Property
US Patent
LigandPNGBDBM192467(US10800746, Example WO 2011/104322 101 | US9187466...)
Affinity DataIC50:  4.40nMT: 2°C. Assay description: On the day before the assay, the cells are plated out in culture medium (DMEM, 10% FCS, 2 mM glutamine, 10 mM HEPES) in 384-well microtiter plates an...
In DepthDetails US Patent
TargetVasopressin V1a receptor(Homo sapiens (Human))
Bayer Intellectual Property
US Patent
LigandPNGBDBM192467(US10800746, Example WO 2011/104322 101 | US9187466...)
Affinity DataIC50:  42.2nM. Assay description: The identification of agonists and antagonists of the V1a and V2 vasopressin receptors from humans, rats and dogs as well as the quantification of th...
In DepthDetails US Patent
TargetVasopressin V1a receptor(Homo sapiens (Human))
Bayer Intellectual Property
US Patent
LigandPNGBDBM192467(US10800746, Example WO 2011/104322 101 | US9187466...)
Affinity DataIC50:  27nMT: 2°C. Assay description: On the day before the assay, the cells are plated out in culture medium (DMEM, 10% FCS, 2 mM glutamine, 10 mM HEPES) in 384-well microtiter plates an...
In DepthDetails US Patent