BDBM197996 US9221790, 6
SMILES COc1cc(N)c(Cl)cc1C(=O)NCC1CCN(CCCCCn2ccnn2)CC1
InChI Key InChIKey=XBHOSNAFUQCYOB-UHFFFAOYSA-N
Data  1 IC50
  Tab Delimited (TSV)   2D SDfile   Computed 3D by Vconf -m prep SDfile
Find this compound or compounds like it in BindingDB:
Activity Spreadsheet -- Enzyme Inhibition Constant Data from BindingDB
Found 1 hit for monomerid = 197996
Target5-hydroxytryptamine receptor 4(Homo sapiens (Human))
Dong-A Pharm.
US Patent
LigandPNGBDBM197996(US9221790, 6)
Affinity DataIC50:  0.103nM. Assay description: The binding affinity of the compounds for a human 5-HT4 receptor was assayed according to the method as disclosed in the literature [Wyngaert et al.,...
Ligand InfoPC cidPC sid
In DepthDetails US Patent