BDBM198003 US9221790, 13
SMILES COc1cc(N)c(Cl)cc1C(=O)NCC1CCN(Cc2ccc(F)cc2)CC1
InChI Key InChIKey=PTDMPQVDDGTRSH-UHFFFAOYSA-N
Data  1 IC50
  Tab Delimited (TSV)   2D SDfile   Computed 3D by Vconf -m prep SDfile
Find this compound or compounds like it in BindingDB:
Activity Spreadsheet -- Enzyme Inhibition Constant Data from BindingDB
Found 1 hit for monomerid = 198003
Target5-hydroxytryptamine receptor 4(Homo sapiens (Human))
Dong-A Pharm.
US Patent
LigandPNGBDBM198003(US9221790, 13)
Affinity DataIC50:  0.134nM. Assay description: The binding affinity of the compounds for a human 5-HT4 receptor was assayed according to the method as disclosed in the literature [Wyngaert et al.,...
Ligand InfoPC cidPC sid
In DepthDetails US Patent