BDBM200242 AB00984504-01::cid_17399291
SMILES Cn1c2ncn(CCC(=O)NCC3CCCCC3)c2c(=O)n(C)c1=O
InChI Key InChIKey=JVLFMWQJIGZGTP-UHFFFAOYSA-N
Data  1 EC50
  Tab Delimited (TSV)   2D SDfile   Computed 3D by Vconf -m prep SDfile
Find this compound or compounds like it in BindingDB:
Activity Spreadsheet -- Enzyme Inhibition Constant Data from BindingDB
Found 1 hit for monomerid = 200242
TargetCystic fibrosis transmembrane conductance regulator(Homo sapiens (Human))
Southern Research Institute
Curated by PubChem BioAssay
LigandPNGBDBM200242(AB00984504-01 | cid_17399291)
Affinity DataEC50: >5.80E+4nM
In DepthDetails PCBioAssay