BDBM200256 AB00988986-01::cid_73673937
SMILES CC(=O)c1c(C)[nH]c(-c2csc(n2)C(=C/c2ccc[nH]2)\C#N)c1C
InChI Key InChIKey=IGAJILIMJBHIFO-QPEQYQDCSA-N
Data  1 EC50
  Tab Delimited (TSV)   2D SDfile   Computed 3D by Vconf -m prep SDfile
Find this compound or compounds like it in BindingDB:
Activity Spreadsheet -- Enzyme Inhibition Constant Data from BindingDB
Found 1 hit for monomerid = 200256
TargetCystic fibrosis transmembrane conductance regulator(Homo sapiens (Human))
Southern Research Institute
Curated by PubChem BioAssay
LigandPNGBDBM200256(AB00988986-01 | cid_73673937)
Affinity DataEC50: >5.90E+4nM
In DepthDetails PCBioAssay