BDBM200279 AB01004260-01::cid_45839325
SMILES [H]C12CC3([H])CC([H])(C1)CC(C2)(C3)NC(=O)NCCC(=O)N(CCC(C)C)c1c(N)n(CCCC)c(=O)[nH]c1=O
InChI Key InChIKey=ZWFVSWOQXJXZES-UHFFFAOYSA-N
Data  1 EC50
  Tab Delimited (TSV)   2D SDfile   Computed 3D by Vconf -m prep SDfile
Find this compound or compounds like it in BindingDB:
Activity Spreadsheet -- Enzyme Inhibition Constant Data from BindingDB
Found 1 hit for monomerid = 200279
TargetCystic fibrosis transmembrane conductance regulator(Homo sapiens (Human))
Southern Research Institute
Curated by PubChem BioAssay
LigandPNGBDBM200279(AB01004260-01 | cid_45839325)
Affinity DataEC50: >3.90E+4nM
In DepthDetails PCBioAssay