BDBM206088 US9255107, 18
SMILES CN1CCN(Cc2ccc(NC(=O)c3ccc(C)c(c3)C#Cc3ccc(nc3)-c3ncc([nH]3)C(F)(F)F)cc2C(F)(F)F)CC1
InChI Key InChIKey=DAOBQQOAWJAJMF-UHFFFAOYSA-N
Data  1 IC50
  Tab Delimited (TSV)   2D SDfile   Computed 3D by Vconf -m prep SDfile
Find this compound or compounds like it in BindingDB:
Activity Spreadsheet -- Enzyme Inhibition Constant Data from BindingDB
Found 1 hit for monomerid = 206088
TargetTyrosine-protein kinase ABL1 [T315I](Homo sapiens (Human))
Nanjing Sanhome Pharmaceutical
US Patent
LigandPNGBDBM206088(US9255107, 18)
Affinity DataIC50:  57.9nMT: 2°C. Assay description: Serially diluting the compound of the present invention from 1 uM initial concentration in three-fold fashion and formulating 10 concentrations (50.8...
Ligand InfoPC cidPC sid
In DepthDetails US Patent