BDBM214487 US9283222, 594
SMILES CCS(=O)(=O)N1CCN(CC1)C(=O)c1cc(Cc2n[nH]c(=O)c3CCCNc23)ccc1F
InChI Key InChIKey=YPXKZBLIHODTGQ-UHFFFAOYSA-N
Data  1 KI
  Tab Delimited (TSV)   2D SDfile   Computed 3D by Vconf -m prep SDfile
Find this compound or compounds like it in BindingDB:
Activity Spreadsheet -- Enzyme Inhibition Constant Data from BindingDB
Found 1 hit for monomerid = 214487
TargetPoly [ADP-ribose] polymerase 1(Homo sapiens (Human))
Abbvie
US Patent
LigandPNGBDBM214487(US9283222, 594)
Affinity DataKi:  0.700nMpH: 8.0Assay Description:PARP1 assay was conducted in PARP assay buffer containing 50 mM Tris pH 8.0, 1 mM DTT, 4 mM MgCl2. PARP reactions contained 1.5 uM [3H]-NAD+ (1.6 uCi...
Ligand InfoPC cidPC sid
In DepthDetails US Patent