BDBM21458 2-benzyl-3-[(1-{[(benzyloxy)carbonyl]amino}-3-methylbutyl)(hydroxy)phosphoryl]propanoic acid::Phosphinic Peptide Inhibitor, 17
SMILES CC(C)CC(NC(=O)OCc1ccccc1)P(O)(=O)CC(Cc1ccccc1)C(O)=O
InChI Key InChIKey=QLXQJCXQCRYSRP-UHFFFAOYSA-N
Data  1 KI
  Tab Delimited (TSV)   2D SDfile   Computed 3D by Vconf -m prep SDfile
Find this compound or compounds like it in BindingDB:
Activity Spreadsheet -- Enzyme Inhibition Constant Data from BindingDB
Found 1 hit for monomerid = 21458
TargetAngiotensin-converting enzyme 2(Homo sapiens (Human))
University Of Athens
LigandPNGBDBM21458(2-benzyl-3-[(1-{[(benzyloxy)carbonyl]amino}-3-meth...)
Affinity DataKi:  8.00E+3nM ΔG°:  -6.95kcal/molepH: 6.8 T: 2°C. Assay description: Continuous assays were performed by recording the fluorescence increase at 405 nm (excitation@ 320 nm) induced by the cleavage of fluorogenic substra...
In DepthDetails ArticlePubMed